{"text_format":"1","workbook":"xlsx","n_sheets":5,"sheets":["Instructions","Input and Results","Ditch Analysis","Flow Splits","Lists"],"not_rendered":{"charts":0,"images":1,"macros":1,"external_links":0,"defined_names":0,"comments":0,"pivot_tables":0},"unopened":[],"bounds":{"document_bytes":16777216,"sheet_cells":100000,"rows_first":2000,"rows_last":500,"rows_between":2000,"halvings":0,"cell_chars":16384,"cell_head_chars":4096},"cells_cut":0,"cells_raw":0,"read":"whole","date_system":"1900"}

{"sheet":"Instructions","index":0,"n_rows":49,"n_cols":4,"rows_kept":49,"cut":false,"hidden":false,"merged":[]}
["HOW TO USE THIS SPREADSHEET"]
[]
["Background"]
[]
["This spreadsheet is very simple-minded an can only deal with two ditch configurations.  The \"V\" ditch has"]
["five specific data points and the trapezoidal ditch has six.  The configuration and data point locations for each"]
["configuration are illustrated to the right."]
[]
["If you don't enter cross section data according to these configurations, your results will be mush at best."]
[]
["This spreadsheet does use a macro and may thus create security issues on your computer."]
[]
[]
["Data Entry"]
[]
["The only location where data is to be entered into this spreadsheet is in the upper left portion of the \"Input"]
["and Results\" tab.  The only locations where data is to be entered are marked with boxes."]
[]
["The first four input variables are as follows:"]
[]
[null,null,"Ditch Type =  ","This is used to select the ditch configuration as discussed above.  There are two "]
[null,null,null,"choices that are offered in a drop-down menu."]
[]
[null,null,"Inlet side =  ","Specifies which side of the ditch the P-12A inlet will be on.  On the left side, the"]
[null,null,null,"bottom of the inlet is assumed to be at point 3 and to extend up towards point 2."]
[null,null,null,"On the right side, the inlet begins at point 3 in the \"V\" ditch and point 4 in the"]
[null,null,null,"trapezoidal ditch.  From the beginning point, the inlet will extend towards the"]
[null,null,null,"next point to the right."]
[]
[null,null,"Discharge =  ","Flow rate (in case not obvious)"]
[]
[null,null,"Longitudinal slope =  ","The slope of the ditch parallel to the roadway."]
[]
["Below these four data entry points is the table for entering the ditch cross section data.  There are three columns:"]
[]
[null,null,"x =  ","The horizontal distance from left to right."]
[]
[null,null,"Elevation =  ","Elevation, of course."]
[]
[null,null,"Manning's n =  ","The Manning's roughness coefficient for the particular segment.  The data is"]
[null,null,null,"entered based on assuming that the roughness extends to the right from the"]
[null,null,null,"point it is entered for.  Thus, the last point does not need a roughness value."]
[]
[]
[]
["By using this spreadsheet, the user"]
["agrees to take full responsibility to"]
["evaluate the results and ensure that"]
["they are correct."]

{"sheet":"Input and Results","index":1,"n_rows":62,"n_cols":13,"rows_kept":62,"cut":false,"hidden":false,"merged":[[1,9,1,14],[2,9,2,11],[5,0,5,3],[13,0,13,2],[7,2,7,3],[8,2,8,3],[9,2,9,3],[10,2,10,3],[2,2,2,3]]}
["P-12A INLETS ON GRADE - FLOW INTERCEPTION"]
[null,null,null,null,null,null,null,null,"Project:  "]
[null,"Computed by:  ",null,null,null,"Date:  ",null,null,"Str. #:  "]
[]
["DATA ENTRY",null,null,null,null,null,null,null,null,null,"Background"]
["To use, fill in yellow highlighted cells."]
[]
[null,"Ditch Type:  ",null,null,null,null,null,null,null,null,"Grate width:  ",2.39,"feet (along flow direction)"]
[null,"Inlet side:  ",null,null,null,null,null,null,null,null,"Grade Length:  ",3.77,"feet (along ditch slope)"]
[null,"Discharge:  ",null,null,"cfs",null,null,null,null,null,"Splash-over velocity:  ",4.84,"ft/sec"]
[null,"Longitudinal slope:  ",null,null,"ft/ft"]
[]
[]
["Enter ditch cross section data:"]
[null,null,null,null,null,null,null,null,null,null,null,"By using this spreadsheet, the user"]
["Point",null,null,null,null,"Mannings",null,null,null,null,null,"agrees to take full responsibility to"]
["Number","Segment Type*",null,"X","Elevation","n",null,null,null,null,null,"evaluate the results and ensure that"]
[1,"Left shoulder",null,null,null,null,null,"Check:  Will inlet fit?",null,null,null,"they are correct."]
[2,"Left slope",null,null,null,null,null,"Left:  ",{"$f":"IF(((D19-D20)^2+(E19-E20)^2)^0.5<$L$9,\"No\",\"Yes\")","v":"No"}]
[3,{"$f":"IF(C8=\"Trapezoidal\",\"Bottom\",\"Right slope\")","v":"Right slope"},null,null,null,null,null,{"$f":"IF(C8=\"Trapezoidal\",\" \",\"Right:  \")","v":"Right:  "},{"$f":"IF(C8=\"Trapezoidal\",\" \",IF(((D20-D21)^2+(E20-E21)^2)^0.5<$L$9,\"No\",\"Yes\"))","v":"No"}]
[4,{"$f":"IF(C8=\"Trapezoidal\",\"Right slope\",\"Right shoulder\")","v":"Right shoulder"},null,null,null,null,null,{"$f":"IF(C8=\"Trapezoidal\",\"Right:  \",\" \")","v":" "},{"$f":"IF(C8=\"Trapezoidal\",IF(((D21-D22)^2+(E21-E22)^2)^0.5<$L$9,\"No\",\"Yes\"),\" \")","v":" "}]
[5,{"$f":"IF(C8=\"Trapezoidal\",\"Right shoulder\",\"-End point-\")","v":"-End point-"}]
[{"$f":"IF(C8=\"Trapezoidal\",6,\"-\")","v":"-"},{"$f":"IF(C8=\"Trapezoidal\",\"-End point-\",\" \")","v":" "}]
[]
["* Type is marked at the start of the segment"]
[]
[]
["RESULTS SUMMARY"]
[]
[null,"Flow depth:  ",{"$f":"'Ditch Analysis'!C10-MIN('Input and Results'!E18:E22)","v":{"$error":"#VALUE!"}},"feet"]
[]
[null,null,"Left of",null,"Right of","Total","Bypass"]
[null,null,"grate","On grate","grate","flow","flow"]
[]
[null,"Inflow:  ",{"$f":"C46","v":{"$error":"#VALUE!"}},{"$f":"C53","v":{"$error":"#VALUE!"}},{"$f":"C59","v":{"$error":"#VALUE!"}},{"$f":"SUM(C35:E35)","v":{"$error":"#VALUE!"}}]
[null,"Intercepted flow:  ",{"$f":"C49","v":{"$error":"#VALUE!"}},{"$f":"C55","v":{"$error":"#VALUE!"}},{"$f":"C62","v":{"$error":"#VALUE!"}},{"$f":"SUM(C36:E36)","v":{"$error":"#VALUE!"}},{"$f":"C10-F36","v":{"$error":"#VALUE!"}}]
[]
[]
["INLET COMPUTATIONS"]
[]
[]
[null,null,"Average flow velocity:  ",{"$f":"C10/'Flow Splits'!I17","v":{"$error":"#VALUE!"}},"ft/sec"]
[]
["Left side flow:"]
[]
[null,"Discharge:  ",{"$f":"'Flow Splits'!J34","v":{"$error":"#VALUE!"}},"cfs"]
[null,"Side slope:  ",{"$f":"(E19-E20)/(D20-D19)","v":{"$error":"#DIV/0!"}},"ft/ft"]
[null,"Efficiency:  ",{"$f":"1/(1+0.15*$D$42^1.8/C47/$L$8^2.3)","v":{"$error":"#VALUE!"}}]
[null,"Q in:  ",{"$f":"C46*C48","v":{"$error":"#VALUE!"}},"cfs"]
[]
["Frontal flow on grate:"]
[]
[null,"Discharge:  ",{"$f":"'Flow Splits'!J35","v":{"$error":"#VALUE!"}},"cfs"]
[null,"Efficiency:  ",{"$f":"MIN(1-0.09*(D42-L10),1)","v":{"$error":"#VALUE!"}}]
[null,"Q in:  ",{"$f":"C54*C53","v":{"$error":"#VALUE!"}},"cfs"]
[]
["Right side flow:"]
[]
[null,"Discharge:  ",{"$f":"'Flow Splits'!J36","v":{"$error":"#VALUE!"}},"cfs"]
[null,"Side slope:  ",{"$f":"IF(C8=\"Trapezoidal\",(E22-E21)/(D22-D21),(E21-E20)/(D21-D20))","v":{"$error":"#DIV/0!"}},"ft/ft"]
{"$rows_left_out":3}
{"sheet":"Ditch Analysis","index":2,"n_rows":177,"n_cols":11,"rows_kept":177,"cut":false,"hidden":false,"merged":[]}
["DETERMINE FLOW DEPTH IN DITCH:"]
[]
["Elevation range:",null,null,null,"Ratiing curve:",null,null,null,null,"Make sure the cross section points"]
[null,"Bottom:  ",{"$f":"MIN('Input and Results'!E18:E23)","v":0},null,null,null,null,null,null,"match the pattern described in the"]
[null,"Top:  ",{"$f":"MIN('Input and Results'!E18,MAX('Input and Results'!E22:E23))","v":0},null,"Rating",null,null,null,null,"instructions!  If not, you will get mush."]
[null,null,null,null,"Number","Elevation","K"]
[null,null,null,null,0,{"$f":"C4","v":0},0]
["Required conveyance:",null,null,null,1,{"$f":"F7+($C$5-$C$4)/10","v":0},{"$f":"K33","v":{"$error":"#VALUE!"}}]
[null,"K = ",{"$f":"'Input and Results'!C10:D10/'Input and Results'!C11:D11^0.5","v":{"$error":"#DIV/0!"}},null,2,{"$f":"F8+($C$5-$C$4)/10","v":0},{"$f":"K49","v":{"$error":"#VALUE!"}}]
[null,"Elev. = ",{"$f":"linterp(C9,G7:G17,F7:F17,11)","v":{"$error":"#VALUE!"}},null,3,0,{"$f":"K65","v":{"$error":"#VALUE!"}}]
[null,null,null,null,4,0,{"$f":"K81","v":{"$error":"#VALUE!"}}]
[null,null,null,null,5,0,{"$f":"K97","v":{"$error":"#VALUE!"}}]
[null,null,null,null,6,0,{"$f":"K113","v":{"$error":"#VALUE!"}}]
[null,null,null,null,7,0,{"$f":"K129","v":{"$error":"#VALUE!"}}]
[null,null,null,null,8,0,{"$f":"K145","v":{"$error":"#VALUE!"}}]
[null,null,null,null,9,0,{"$f":"K161","v":{"$error":"#VALUE!"}}]
[null,null,null,null,10,0,{"$f":"K177","v":{"$error":"#VALUE!"}}]
[]
[]
["Rating #:  ",1,null,null,"Start X:  ",{"$f":"linterpdown(B21,C26:C28,B26:B28,3)","v":{"$error":"#VALUE!"}}]
["Elev:  ",{"$f":"VLOOKUP(B20,$E$7:$F$17,2)","v":0},null,null,"End X:  ",{"$f":"IF('Input and Results'!C8=\"Trapezoidal\",linterp('Ditch Analysis'!B21,'Ditch Analysis'!C29:C31,'Ditch Analysis'!B29:B31,3),linterp('Ditch Analysis'!B21,'Ditch Analysis'!C28:C30,'Ditch Analysis'!B28:B30,3))","v":{"$error":"#VALUE!"}}]
[]
["Point",null,null,null,"Start","End","Start","End",null,"Wetted"]
["Number","X","Elev.","n","X","X","Depth","Depth","Area","Perimeter","Pxn^1.5"]
[]
[1,{"$f":"'Input and Results'!$D$18","v":0},{"$f":"'Input and Results'!$E$18","v":0},{"$f":"'Input and Results'!$F$18","v":0},{"$f":"MIN(B27,MAX(B26,F20))","v":{"$error":"#VALUE!"}},{"$f":"MIN(B27,MAX(B26,F21))","v":{"$error":"#VALUE!"}},{"$f":"MAX(B21-C26,0)","v":0},{"$f":"MAX(B21-C27,0)","v":0},{"$f":"(G26+H26)/2*(F26-E26)","v":{"$error":"#VALUE!"}},{"$f":"((F26-E26)^2+(H26-G26)^2)^0.5","v":{"$error":"#VALUE!"}},{"$f":"J26*D26^1.5","v":{"$error":"#VALUE!"}}]
[2,{"$f":"'Input and Results'!$D$19","v":0},{"$f":"'Input and Results'!$E$19","v":0},{"$f":"'Input and Results'!$F$19","v":0},{"$f":"MIN(B28,MAX(B27,F20))","v":{"$error":"#VALUE!"}},{"$f":"MIN(B28,MAX(B27,F21))","v":{"$error":"#VALUE!"}},{"$f":"MAX(B21-C27,0)","v":0},{"$f":"MAX(B21-C28,0)","v":0},{"$f":"(G27+H27)/2*(F27-E27)","v":{"$error":"#VALUE!"}},{"$f":"((F27-E27)^2+(H27-G27)^2)^0.5","v":{"$error":"#VALUE!"}},{"$f":"J27*D27^1.5","v":{"$error":"#VALUE!"}}]
[3,{"$f":"'Input and Results'!$D$20","v":0},{"$f":"'Input and Results'!$E$20","v":0},{"$f":"'Input and Results'!$F$20","v":0},{"$f":"MIN(B29,MAX(B28,F20))","v":{"$error":"#VALUE!"}},{"$f":"MIN(B29,MAX(B28,F21))","v":{"$error":"#VALUE!"}},{"$f":"MAX(B21-C28,0)","v":0},{"$f":"MAX(B21-C29,0)","v":0},{"$error":"#VALUE!"},{"$error":"#VALUE!"},{"$error":"#VALUE!"}]
[4,{"$f":"'Input and Results'!$D$21","v":0},{"$f":"'Input and Results'!$E$21","v":0},{"$f":"'Input and Results'!$F$21","v":0},{"$f":"MIN(B30,MAX(B29,F20))","v":{"$error":"#VALUE!"}},{"$f":"MIN(B30,MAX(B29,F21))","v":{"$error":"#VALUE!"}},{"$f":"MAX(B21-C29,0)","v":0},{"$f":"MAX(B21-C30,0)","v":0},{"$error":"#VALUE!"},{"$error":"#VALUE!"},{"$error":"#VALUE!"}]
[5,{"$f":"'Input and Results'!$D$22","v":0},{"$f":"'Input and Results'!$E$22","v":0},{"$f":"'Input and Results'!$F$22","v":0},{"$f":"MIN(B31,MAX(B30,F20))","v":{"$error":"#VALUE!"}},{"$f":"MIN(B31,MAX(B30,F21))","v":{"$error":"#VALUE!"}},{"$f":"MAX(B21-C30,0)","v":0},{"$f":"MAX(B21-C31,0)","v":0},{"$error":"#VALUE!"},{"$error":"#VALUE!"},{"$error":"#VALUE!"}]
[6,{"$f":"'Input and Results'!$D$23","v":0},{"$f":"'Input and Results'!$E$23","v":0},{"$f":"'Input and Results'!$F$23","v":0}]
[null,null,null,null,null,null,null,"Totals -->  ",{"$f":"SUM(I26:I31)","v":{"$error":"#VALUE!"}},{"$f":"SUM(J26:J31)","v":{"$error":"#VALUE!"}},{"$f":"(SUM(K26:K30)/J32)^(2/3)","v":{"$error":"#VALUE!"}}]
[null,null,null,null,null,null,null,null,null,"Conveyance -->",{"$f":"1.486*I32*(I32/J32)^(2/3)/K32","v":{"$error":"#VALUE!"}}]
[]
[]
["Rating #:  ",2,null,null,"Start X:  ",{"$f":"linterpdown(B37,C42:C44,B42:B44,3)","v":{"$error":"#VALUE!"}}]
["Elev:  ",{"$f":"VLOOKUP(B36,$E$7:$F$17,2)","v":0},null,null,"End X:  ",{"$f":"IF('Input and Results'!C24=\"Trapezoidal\",linterp('Ditch Analysis'!B37,'Ditch Analysis'!C45:C47,'Ditch Analysis'!B45:B47,3),linterp('Ditch Analysis'!B37,'Ditch Analysis'!C44:C46,'Ditch Analysis'!B44:B46,3))","v":{"$error":"#VALUE!"}}]
[]
["Point",null,null,null,"Start","End","Start","End",null,"Wetted"]
["Number","X","Elev.","n","X","X","Depth","Depth","Area","Perimeter","Pxn^1.5"]
[]
[1,{"$f":"'Input and Results'!$D$18","v":0},{"$f":"'Input and Results'!$E$18","v":0},{"$f":"'Input and Results'!$F$18","v":0},{"$f":"MIN(B43,MAX(B42,F36))","v":{"$error":"#VALUE!"}},{"$f":"MIN(B43,MAX(B42,F37))","v":{"$error":"#VALUE!"}},{"$f":"MAX(B37-C42,0)","v":0},{"$f":"MAX(B37-C43,0)","v":0},{"$f":"(G42+H42)/2*(F42-E42)","v":{"$error":"#VALUE!"}},{"$f":"((F42-E42)^2+(H42-G42)^2)^0.5","v":{"$error":"#VALUE!"}},{"$f":"J42*D42^1.5","v":{"$error":"#VALUE!"}}]
[2,{"$f":"'Input and Results'!$D$19","v":0},{"$f":"'Input and Results'!$E$19","v":0},{"$f":"'Input and Results'!$F$19","v":0},{"$f":"MIN(B44,MAX(B43,F36))","v":{"$error":"#VALUE!"}},{"$f":"MIN(B44,MAX(B43,F37))","v":{"$error":"#VALUE!"}},{"$f":"MAX(B37-C43,0)","v":0},{"$f":"MAX(B37-C44,0)","v":0},{"$f":"(G43+H43)/2*(F43-E43)","v":{"$error":"#VALUE!"}},{"$f":"((F43-E43)^2+(H43-G43)^2)^0.5","v":{"$error":"#VALUE!"}},{"$f":"J43*D43^1.5","v":{"$error":"#VALUE!"}}]
[3,{"$f":"'Input and Results'!$D$20","v":0},{"$f":"'Input and Results'!$E$20","v":0},{"$f":"'Input and Results'!$F$20","v":0},{"$f":"MIN(B45,MAX(B44,F36))","v":{"$error":"#VALUE!"}},{"$f":"MIN(B45,MAX(B44,F37))","v":{"$error":"#VALUE!"}},{"$f":"MAX(B37-C44,0)","v":0},{"$f":"MAX(B37-C45,0)","v":0},{"$error":"#VALUE!"},{"$error":"#VALUE!"},{"$error":"#VALUE!"}]
[4,{"$f":"'Input and Results'!$D$21","v":0},{"$f":"'Input and Results'!$E$21","v":0},{"$f":"'Input and Results'!$F$21","v":0},{"$f":"MIN(B46,MAX(B45,F36))","v":{"$error":"#VALUE!"}},{"$f":"MIN(B46,MAX(B45,F37))","v":{"$error":"#VALUE!"}},{"$f":"MAX(B37-C45,0)","v":0},{"$f":"MAX(B37-C46,0)","v":0},{"$error":"#VALUE!"},{"$error":"#VALUE!"},{"$error":"#VALUE!"}]
[5,{"$f":"'Input and Results'!$D$22","v":0},{"$f":"'Input and Results'!$E$22","v":0},{"$f":"'Input and Results'!$F$22","v":0},{"$f":"MIN(B47,MAX(B46,F36))","v":{"$error":"#VALUE!"}},{"$f":"MIN(B47,MAX(B46,F37))","v":{"$error":"#VALUE!"}},{"$f":"MAX(B37-C46,0)","v":0},{"$f":"MAX(B37-C47,0)","v":0},{"$error":"#VALUE!"},{"$error":"#VALUE!"},{"$error":"#VALUE!"}]
[6,{"$f":"'Input and Results'!$D$23","v":0},{"$f":"'Input and Results'!$E$23","v":0},{"$f":"'Input and Results'!$F$23","v":0}]
[null,null,null,null,null,null,null,"Totals -->  ",{"$f":"SUM(I42:I47)","v":{"$error":"#VALUE!"}},{"$f":"SUM(J42:J47)","v":{"$error":"#VALUE!"}},{"$f":"(SUM(K42:K46)/J48)^(2/3)","v":{"$error":"#VALUE!"}}]
[null,null,null,null,null,null,null,null,null,"Conveyance -->",{"$f":"1.486*I48*(I48/J48)^(2/3)/K48","v":{"$error":"#VALUE!"}}]
[]
[]
["Rating #:  ",3,null,null,"Start X:  ",{"$f":"linterpdown(B53,C58:C60,B58:B60,3)","v":{"$error":"#VALUE!"}}]
["Elev:  ",{"$f":"VLOOKUP(B52,$E$7:$F$17,2)","v":0},null,null,"End X:  ",{"$f":"IF('Input and Results'!C51=\"Trapezoidal\",linterp('Ditch Analysis'!B53,'Ditch Analysis'!C61:C63,'Ditch Analysis'!B61:B63,3),linterp('Ditch Analysis'!B53,'Ditch Analysis'!C60:C62,'Ditch Analysis'!B60:B62,3))","v":{"$error":"#VALUE!"}}]
[]
["Point",null,null,null,"Start","End","Start","End",null,"Wetted"]
["Number","X","Elev.","n","X","X","Depth","Depth","Area","Perimeter","Pxn^1.5"]
[]
[1,{"$f":"'Input and Results'!$D$18","v":0},{"$f":"'Input and Results'!$E$18","v":0},{"$f":"'Input and Results'!$F$18","v":0},{"$f":"MIN(B59,MAX(B58,F52))","v":{"$error":"#VALUE!"}},{"$f":"MIN(B59,MAX(B58,F53))","v":{"$error":"#VALUE!"}},{"$f":"MAX(B53-C58,0)","v":0},{"$f":"MAX(B53-C59,0)","v":0},{"$f":"(G58+H58)/2*(F58-E58)","v":{"$error":"#VALUE!"}},{"$f":"((F58-E58)^2+(H58-G58)^2)^0.5","v":{"$error":"#VALUE!"}},{"$f":"J58*D58^1.5","v":{"$error":"#VALUE!"}}]
[2,{"$f":"'Input and Results'!$D$19","v":0},{"$f":"'Input and Results'!$E$19","v":0},{"$f":"'Input and Results'!$F$19","v":0},{"$f":"MIN(B60,MAX(B59,F52))","v":{"$error":"#VALUE!"}},{"$f":"MIN(B60,MAX(B59,F53))","v":{"$error":"#VALUE!"}},{"$f":"MAX(B53-C59,0)","v":0},{"$f":"MAX(B53-C60,0)","v":0},{"$f":"(G59+H59)/2*(F59-E59)","v":{"$error":"#VALUE!"}},{"$f":"((F59-E59)^2+(H59-G59)^2)^0.5","v":{"$error":"#VALUE!"}},{"$f":"J59*D59^1.5","v":{"$error":"#VALUE!"}}]
[3,{"$f":"'Input and Results'!$D$20","v":0},{"$f":"'Input and Results'!$E$20","v":0},{"$f":"'Input and Results'!$F$20","v":0},{"$f":"MIN(B61,MAX(B60,F52))","v":{"$error":"#VALUE!"}},{"$f":"MIN(B61,MAX(B60,F53))","v":{"$error":"#VALUE!"}},{"$f":"MAX(B53-C60,0)","v":0},{"$f":"MAX(B53-C61,0)","v":0},{"$error":"#VALUE!"},{"$error":"#VALUE!"},{"$error":"#VALUE!"}]
{"$rows_left_out":118}
{"sheet":"Flow Splits","index":3,"n_rows":38,"n_cols":16,"rows_kept":38,"cut":false,"hidden":false,"merged":[]}
["DETERMINE FRONTAL AND SIDE FLOWS"]
[]
["Ditch flow:"]
[]
[null,null,null,null,"Start X:  ",{"$f":"linterpdown(B6,C11:C13,B11:B13,3)","v":{"$error":"#VALUE!"}},null,{"$f":"MATCH(F5,B11:B16)","v":{"$error":"#VALUE!"}}]
["Elev:  ",{"$f":"'Ditch Analysis'!C10","v":{"$error":"#VALUE!"}},null,null,"End X:  ",{"$f":"IF('Input and Results'!C8=\"Trapezoidal\",linterp(B6,C14:C16,B14:B16,3),linterp(B6,C13:C15,B13:B15,3))","v":{"$error":"#VALUE!"}},null,{"$f":"MATCH(F6,B11:B16)","v":{"$error":"#VALUE!"}},null,null,null,null,null,"Rating for comp's:"]
[null,null,null,null,null,null,null,null,null,null,null,"Cumulative",null,null,null,"Cumulative"]
["Point",null,null,null,"Start","End","Start","End",null,"Wetted",null,"K by",null,"Point",null,"K by"]
["Number","X","Elev.","n","X","X","Depth","Depth","Area","Perimeter","Pxn^1.5","segment",null,"Number","X","segment"]
[]
[1,{"$f":"'Input and Results'!$D$18","v":0},{"$f":"'Input and Results'!$E$18","v":0},{"$f":"'Input and Results'!$F$18","v":0},{"$f":"MIN(B12,MAX(B11,F5))","v":{"$error":"#VALUE!"}},{"$f":"MIN(B12,MAX(B11,F6))","v":{"$error":"#VALUE!"}},{"$f":"MAX(B6-C11,0)","v":{"$error":"#VALUE!"}},{"$f":"MAX(B6-C12,0)","v":{"$error":"#VALUE!"}},{"$f":"(G11+H11)/2*(F11-E11)","v":{"$error":"#VALUE!"}},{"$f":"((F11-E11)^2+(H11-G11)^2)^0.5","v":{"$error":"#VALUE!"}},{"$f":"J11*D11^1.5","v":{"$error":"#VALUE!"}},{"$f":"IF(J11>0,1.486*I11*(I11/J11)^(2/3)/D11,0)","v":{"$error":"#VALUE!"}},null,{"$f":"H5","v":{"$error":"#VALUE!"}},{"$f":"F5","v":{"$error":"#VALUE!"}},0]
[2,{"$f":"'Input and Results'!$D$19","v":0},{"$f":"'Input and Results'!$E$19","v":0},{"$f":"'Input and Results'!$F$19","v":0},{"$f":"MIN(B13,MAX(B12,F5))","v":{"$error":"#VALUE!"}},{"$f":"MIN(B13,MAX(B12,F6))","v":{"$error":"#VALUE!"}},{"$f":"MAX(B6-C12,0)","v":{"$error":"#VALUE!"}},{"$f":"MAX(B6-C13,0)","v":{"$error":"#VALUE!"}},{"$f":"(G12+H12)/2*(F12-E12)","v":{"$error":"#VALUE!"}},{"$f":"((F12-E12)^2+(H12-G12)^2)^0.5","v":{"$error":"#VALUE!"}},{"$f":"J12*D12^1.5","v":{"$error":"#VALUE!"}},{"$f":"IF(J12>0,1.486*I12*(I12/J12)^(2/3)/D12,0)+L11","v":{"$error":"#VALUE!"}},null,{"$f":"IF(N11+1>$H$6+1,\"n/a\",N11+1)","v":{"$error":"#VALUE!"}},{"$f":"IF(INDEX($B$11:$B$16,N12)>$F$6,$F$6,INDEX($B$11:$B$16,N12))","v":{"$error":"#VALUE!"}},{"$f":"INDEX($L$11:$L$15,N12-1)","v":{"$error":"#VALUE!"}}]
[3,{"$f":"'Input and Results'!$D$20","v":0},{"$f":"'Input and Results'!$E$20","v":0},{"$f":"'Input and Results'!$F$20","v":0},{"$f":"MIN(B14,MAX(B13,F5))","v":{"$error":"#VALUE!"}},{"$f":"MIN(B14,MAX(B13,F6))","v":{"$error":"#VALUE!"}},{"$f":"MAX(B6-C13,0)","v":{"$error":"#VALUE!"}},{"$f":"MAX(B6-C14,0)","v":{"$error":"#VALUE!"}},{"$error":"#VALUE!"},{"$error":"#VALUE!"},{"$error":"#VALUE!"},{"$f":"IF(J13>0,1.486*I13*(I13/J13)^(2/3)/D13,0)+L12","v":{"$error":"#VALUE!"}},null,{"$f":"IF(N12+1>$H$6+1,\"n/a\",N12+1)","v":{"$error":"#VALUE!"}},{"$f":"IF(INDEX($B$11:$B$16,N13)>$F$6,$F$6,INDEX($B$11:$B$16,N13))","v":{"$error":"#VALUE!"}},{"$f":"INDEX($L$11:$L$15,N13-1)","v":{"$error":"#VALUE!"}}]
[4,{"$f":"'Input and Results'!$D$21","v":0},{"$f":"'Input and Results'!$E$21","v":0},{"$f":"'Input and Results'!$F$21","v":0},{"$f":"MIN(B15,MAX(B14,F5))","v":{"$error":"#VALUE!"}},{"$f":"MIN(B15,MAX(B14,F6))","v":{"$error":"#VALUE!"}},{"$f":"MAX(B6-C14,0)","v":{"$error":"#VALUE!"}},{"$f":"MAX(B6-C15,0)","v":{"$error":"#VALUE!"}},{"$error":"#VALUE!"},{"$error":"#VALUE!"},{"$error":"#VALUE!"},{"$error":"#VALUE!"},null,{"$error":"#VALUE!"},{"$error":"#VALUE!"},{"$error":"#VALUE!"}]
[5,{"$f":"'Input and Results'!$D$22","v":0},{"$f":"'Input and Results'!$E$22","v":0},{"$f":"'Input and Results'!$F$22","v":0},{"$f":"MIN(B16,MAX(B15,F5))","v":{"$error":"#VALUE!"}},{"$f":"MIN(B16,MAX(B15,F6))","v":{"$error":"#VALUE!"}},{"$f":"MAX(B6-C15,0)","v":{"$error":"#VALUE!"}},{"$f":"MAX(B6-C16,0)","v":{"$error":"#VALUE!"}},{"$error":"#VALUE!"},{"$error":"#VALUE!"},{"$error":"#VALUE!"},{"$error":"#VALUE!"},null,{"$error":"#VALUE!"},{"$error":"#VALUE!"},{"$error":"#VALUE!"}]
[6,{"$f":"'Input and Results'!$D$23","v":0},{"$f":"'Input and Results'!$E$23","v":0},{"$f":"'Input and Results'!$F$23","v":0},null,null,null,null,null,null,null,null,null,{"$error":"#VALUE!"},{"$error":"#VALUE!"},{"$error":"#VALUE!"}]
[null,null,null,null,null,null,null,"Totals -->  ",{"$f":"SUM(I11:I16)","v":{"$error":"#VALUE!"}},{"$f":"SUM(J11:J16)","v":{"$error":"#VALUE!"}},{"$f":"(SUM(K11:K15)/J17)^(2/3)","v":{"$error":"#VALUE!"}}]
[null,null,null,null,null,null,null,null,null,"Conveyance -->",{"$f":"1.486*I17*(I17/J17)^(2/3)/K17","v":{"$error":"#VALUE!"}}]
[]
[]
[]
["Grate stations:"]
[]
[null,"Bottom station:  ",{"$f":"IF('Input and Results'!C9=\"Left\",B13,IF('Input and Results'!C8=\"Trapezoidal\",B14,B13))","v":0}]
[null,"Ditch side slope:  ",{"$f":"IF('Input and Results'!C9=\"Left\",ABS(('Flow Splits'!B12-'Flow Splits'!B13)/('Flow Splits'!C12-'Flow Splits'!C13)),IF('Input and Results'!C8=\"Trapezoidal\",ABS(('Flow Splits'!B14-'Flow Splits'!B15)/('Flow Splits'!C14-'Flow Splits'!C15)),ABS(('Flow Splits'!B13-'Flow Splits'!B14)/('Flow Splits'!C13-'Flow Splits'!C14))))","v":{"$error":"#DIV/0!"}},":1"]
[null,"Width on slope:  ",{"$f":"COS(ATAN(1/C25))*'Input and Results'!L9","v":{"$error":"#DIV/0!"}},"feet"]
[null,"Top station:  ",{"$f":"IF('Input and Results'!C9=\"Left\",'Flow Splits'!C24-'Flow Splits'!C26,'Flow Splits'!C24+'Flow Splits'!C26)","v":{"$error":"#DIV/0!"}}]
[]
[]
["Locations for conveyance computations:"]
[]
[null,null,null,"Cumulative",null,"Discharges:",null,"Net K","% of Total","Q"]
[null,null,"Station","K"]
[null,null,null,null,null,null,"Left of grate:  ",{"$f":"D36-D35","v":{"$error":"#VALUE!"}},{"$f":"H34/$D$38","v":{"$error":"#VALUE!"}},{"$f":"I34*'Input and Results'!C10","v":{"$error":"#VALUE!"}}]
[null,"Left edge water  ",{"$f":"MIN(F5,MIN(C24,C27))","v":{"$error":"#DIV/0!"}},{"$f":"linterp(C35,$O$11:$O$16,$P$11:$P$16,($H$6-$H$5+2))","v":{"$error":"#VALUE!"}},null,null,"On grate:  ",{"$f":"D37-D36","v":{"$error":"#VALUE!"}},{"$f":"H35/$D$38","v":{"$error":"#VALUE!"}},{"$f":"I35*'Input and Results'!C10","v":{"$error":"#VALUE!"}}]
[null,"start of grate  ",{"$f":"MIN(C24,C27)","v":{"$error":"#DIV/0!"}},{"$f":"linterp(C36,$O$11:$O$16,$P$11:$P$16,($H$6-$H$5+2))","v":{"$error":"#VALUE!"}},null,null,"Right of grate:  ",{"$f":"D38-D37","v":{"$error":"#VALUE!"}},{"$error":"#VALUE!"},{"$f":"I36*'Input and Results'!C10","v":{"$error":"#VALUE!"}}]
[null,"end of grate  ",{"$f":"MIN(F6,MAX(C24,C27))","v":{"$error":"#DIV/0!"}},{"$error":"#VALUE!"}]
[null,"right edge of water  ",{"$f":"MAX(F6,MAX(C24,C27))","v":{"$error":"#DIV/0!"}},{"$error":"#VALUE!"}]

{"sheet":"Lists","index":4,"n_rows":8,"n_cols":2,"rows_kept":8,"cut":false,"hidden":false,"merged":[]}
[]
[]
[null,"V-Ditch"]
[null,"Trapezoidal"]
[]
[]
[null,"Left"]
[null,"Right"]