{"text_format":"1","workbook":"xlsx","n_sheets":4,"sheets":["Instructions","Computations","INDOT Table","Lookup Tables"],"not_rendered":{"charts":0,"images":0,"macros":1,"external_links":0,"defined_names":0,"comments":0,"pivot_tables":0},"unopened":[],"bounds":{"document_bytes":16777216,"sheet_cells":100000,"rows_first":2000,"rows_last":500,"rows_between":2000,"halvings":0,"cell_chars":16384,"cell_head_chars":4096},"cells_cut":0,"cells_raw":0,"read":"whole","date_system":"1900"}

{"sheet":"Instructions","index":0,"n_rows":106,"n_cols":2,"rows_kept":106,"cut":false,"hidden":false,"merged":[]}
["HOW TO USE THIS INLET SPACING WORKSHEET"]
[]
["PURPOSE"]
["This spreadsheet analyzes gutter flow and inlet interception using methods prescribed in the"]
["INDOT Design Manual, Sections 203.4.  It is intended to simplify the task of placing"]
["curb inlets on grade."]
[]
["HOW TO ENTER DATA"]
["There are a wide variety of variables what affect the performance of an inlet on grade."]
["This spreadsheet uses terminology and variable names which are mostly consistent with"]
["the Design Manual.  Thus, before using this spreadsheet it is recommended that the user"]
["review and be familiar with the Design Manual on computation methods, clogging, etc."]
[]
["Important Note:  This spread is intended to model only one line of inlets extending from a"]
["high point on the roadway profile to a sag point or other form of outlet, along one side of"]
["the roadway.  Thus, there could be several copies of this spreadsheet for a single project."]
["One idea for keeping the spreadsheets organized would be to rename each file to reflect"]
["the inlet numbers it contains."]
[]
[]
{"$rows_left_out":87}
{"sheet":"Computations","index":1,"n_rows":38,"n_cols":41,"rows_kept":38,"cut":false,"hidden":false,"merged":[[11,3,11,4],[11,5,11,7]]}
["DATA INPUT AND COMPUTATIONS PAGE",null,null,null,null,"(Table for INDOT submittal is on the following sheet)"]
[]
[null,"Des Number:  ",null,null,null,null,"Design Frequency:  ",100,"years",null,"Gutter n-value:  ",1.2999999999999999E-2,null,"Computed by:  "]
[null,"Project:  ",null,null,null,null,null,null,null,null,"(See Design Manual,",null,null,"Date: "]
[null,"Location:  ",null,null,null,null,"Enter Rainfall   ","Duration","Intensity",null,"Figure 203-4C)"]
[null,null,null,null,null,null,"from NOAA:  ","(min)","(in/hr)",null,null,null,null,"Checked by:  "]
[null,"Station of High Pt:  ",null,null,null,null,null,5,7.33,null,null,null,null,"Date: "]
[null,"Station of Low Pt:  ",null,null,null,null,null,10,5.66]
[null,"Side:  ",null,null,null,null,null,15,4.76,null,null,null,null,"Sheet",1,"of",1]
[null,null,null,null,null,null,null,30,3.3]
["DATA ENTRY SECTION:",null,null,null,null,null,null,null,null,null,null,null,null,null,null,"COMPUTATION SECTION:",null,null,null,null,"(Do not enter data in this area)",null,null,null,null,null,null,null,null,null,null,null,null,null,null,null,"Computations for frontal and side flow"]
[null,null,null,"On-Site Area",null,"Off-Site Area",null,null,"Slope of","Pavement","Gutter",null,null,null,null,null,null,null,null,null,null,null,null,null,"Splash-"]
[null,null,null,"Average",null,null,null,"Time of","P.G.","Cross","Cross","Gutter","Allowable",null,null,"Inlet",null,null,null,null,"Req'd",null,"Grate","Grate","Over","Flow","Frontal","Frontal","Frontal",null,"Side Flow","Side Flow","Total",null,null,null,null,null,null,"Frontal","Side"]
[null,"Inlet",null,"Width","Rational","DA","Rational","Conc.","(SL)","Slope (Sx)","Slope (Sw)","Width (w)","Spread","Inlet",null,"Drainage",null,"Intensity","Q","Spread","Convey-","Depth","Width","Length","Velocity","Velocity","Flow","Efficiency","Flow In","Side Flow","Efficiency","In","Flow In","Runby",null,null,null,null,null,"Flow Area","Flow Area"]
[null,"Number","Station","(feet)","C","(acres)","C","(min)","(ft/ft)","(ft/ft)","(ft/ft)","(feet)","(feet)","Type",null,"Area (ac)","CA","(in/hr)","(cfs)","(feet)","ance (K)","(feet)","(feet)","(feet)","(fps)","(fps)","(cfs)","(Rf)","(cfs)","(cfs)","(Rs)","(cfs)","(cfs)","(cfs)",null,null,"Sw / Sx","T/W","Eo","(sf)","(sf)"]
[]
[1,224,3110,null,null,5.9700000000000003E-2,0.8,5,7.0000000000000001E-3,0.02,0.02,2,6,15,null,{"$f":"ABS(C17-C7)*D17/43560+F17","v":5.9700000000000003E-2},{"$f":"ABS(C17-C7)*D17/43560*E17+F17*G17","v":4.7760000000000004E-2},{"$f":"IF(F17>0,linterp(MAX(5,H17),$H$7:$H$10,$I$7:$I$10,4),$I$7)","v":7.33},{"$f":"Q17*R17+AH16","v":0.35008080000000003},{"$f":"MIN(V17/K17,L17)+MAX(0,(V17-(K17*L17))/J17)","v":4.810791015625},{"$f":"S17/I17^0.5","v":4.1842658773867205},{"$f":"GutDepth(J17,K17,L17,$L$3,U17)","v":9.6215820312499992E-2},{"$f":"VLOOKUP(N17,'Lookup Tables'!$B$8:$E$17,2)","v":1.7},{"$f":"VLOOKUP(N17,'Lookup Tables'!$B$8:$E$17,3)","v":3.79},{"$f":"VLOOKUP(N17,'Lookup Tables'!$B$8:$E$17,4)","v":8.58},{"$f":"S17/(AN17+AO17)","v":1.5126390584523914},{"$f":"S17*AM17","v":0.24078200014464793},{"$f":"MIN(1,1-0.09*(Z17-Y17))","v":1},{"$f":"AA17*AB17","v":0.24078200014464793},{"$f":"S17-AA17","v":0.1092987998553521},{"$f":"J17*X17^2.3/(J17*X17^2.3+0.15*Z17^1.8)","v":0.57556622289752302},{"$f":"AE17*AD17","v":6.2908697399977342E-2},{"$f":"AC17+AF17","v":0.3036906975446253},{"$f":"S17-AG17","v":4.6390102455374727E-2},null,null,{"$f":"K17/J17","v":1},{"$f":"T17/W17","v":2.8298770680147061},{"$f":"1/(1+AK17/((1+AK17/(AL17-1))^2.67-1))","v":0.68778979065589407},{"$f":"((V17+MAX(0,V17-(K17*W17)))/2)*MIN(V17/K17,W17)","v":0.13466689453124997},{"$f":"MAX(0,0.5*(T17-W17)*(V17-(K17*W17)))","v":9.6770207428932165E-2}]
[2,null,null,null,null,null,null,null,null,null,null,null,null,null,null,{"$f":"ABS(C18-C17)*D18/43560+F18","v":0},{"$f":"ABS(C18-C17)*D18/43560*E18+F18*G18","v":0},{"$f":"IF(F18>0,linterp(MAX(5,H18),$H$7:$H$10,$I$7:$I$10,4),$I$7)","v":7.33},{"$f":"Q18*R18+AH17","v":4.6390102455374727E-2},{"$f":"MIN(V18/K18,L18)+MAX(0,(V18-(K18*L18))/J18)","v":{"$error":"#VALUE!"}},{"$f":"S18/I18^0.5","v":{"$error":"#DIV/0!"}},{"$f":"GutDepth(J18,K18,L18,$L$3,U18)","v":{"$error":"#VALUE!"}},{"$f":"VLOOKUP(N18,'Lookup Tables'!$B$8:$E$17,2)","v":{"$error":"#N/A"}},{"$f":"VLOOKUP(N18,'Lookup Tables'!$B$8:$E$17,3)","v":{"$error":"#N/A"}},{"$f":"VLOOKUP(N18,'Lookup Tables'!$B$8:$E$17,4)","v":{"$error":"#N/A"}},{"$f":"S18/(AN18+AO18)","v":{"$error":"#VALUE!"}},{"$f":"S18*AM18","v":{"$error":"#DIV/0!"}},{"$f":"MIN(1,1-0.09*(Z18-Y18))","v":{"$error":"#VALUE!"}},{"$f":"AA18*AB18","v":{"$error":"#DIV/0!"}},{"$f":"S18-AA18","v":{"$error":"#DIV/0!"}},{"$f":"J18*X18^2.3/(J18*X18^2.3+0.15*Z18^1.8)","v":{"$error":"#N/A"}},{"$f":"AE18*AD18","v":{"$error":"#N/A"}},{"$f":"AC18+AF18","v":{"$error":"#DIV/0!"}},{"$f":"S18-AG18","v":{"$error":"#DIV/0!"}},null,null,{"$f":"K18/J18","v":{"$error":"#DIV/0!"}},{"$f":"T18/W18","v":{"$error":"#VALUE!"}},{"$f":"1/(1+AK18/((1+AK18/(AL18-1))^2.67-1))","v":{"$error":"#DIV/0!"}},{"$error":"#VALUE!"},{"$f":"MAX(0,0.5*(T18-W18)*(V18-(K18*W18)))","v":{"$error":"#VALUE!"}}]
[3,null,null,null,null,null,null,null,null,null,null,null,null,null,null,{"$f":"ABS(C19-C18)*D19/43560+F19","v":0},{"$f":"ABS(C19-C18)*D19/43560*E19+F19*G19","v":0},7.33,{"$error":"#DIV/0!"},{"$error":"#VALUE!"},{"$error":"#DIV/0!"},{"$error":"#VALUE!"},{"$f":"VLOOKUP(N19,'Lookup Tables'!$B$8:$E$17,2)","v":{"$error":"#N/A"}},{"$f":"VLOOKUP(N19,'Lookup Tables'!$B$8:$E$17,3)","v":{"$error":"#N/A"}},{"$f":"VLOOKUP(N19,'Lookup Tables'!$B$8:$E$17,4)","v":{"$error":"#N/A"}},{"$error":"#DIV/0!"},{"$error":"#DIV/0!"},{"$error":"#DIV/0!"},{"$error":"#DIV/0!"},{"$error":"#DIV/0!"},{"$error":"#N/A"},{"$error":"#N/A"},{"$error":"#DIV/0!"},{"$error":"#DIV/0!"},null,null,{"$error":"#DIV/0!"},{"$error":"#VALUE!"},{"$error":"#DIV/0!"},{"$error":"#VALUE!"},{"$error":"#VALUE!"}]
[4,null,null,null,null,null,null,null,null,null,null,null,null,null,null,0,0,7.33,{"$error":"#DIV/0!"},{"$error":"#VALUE!"},{"$error":"#DIV/0!"},{"$error":"#VALUE!"},{"$f":"VLOOKUP(N20,'Lookup Tables'!$B$8:$E$17,2)","v":{"$error":"#N/A"}},{"$f":"VLOOKUP(N20,'Lookup Tables'!$B$8:$E$17,3)","v":{"$error":"#N/A"}},{"$f":"VLOOKUP(N20,'Lookup Tables'!$B$8:$E$17,4)","v":{"$error":"#N/A"}},{"$error":"#DIV/0!"},{"$error":"#DIV/0!"},{"$error":"#DIV/0!"},{"$error":"#DIV/0!"},{"$error":"#DIV/0!"},{"$error":"#N/A"},{"$error":"#N/A"},{"$error":"#DIV/0!"},{"$error":"#DIV/0!"},null,null,{"$error":"#DIV/0!"},{"$error":"#VALUE!"},{"$error":"#DIV/0!"},{"$error":"#VALUE!"},{"$error":"#VALUE!"}]
{"$rows_left_out":19}
{"sheet":"INDOT Table","index":2,"n_rows":35,"n_cols":19,"rows_kept":35,"cut":false,"hidden":false,"merged":[[34,0,34,18],[1,8,1,9],[1,13,1,14]]}
["PROJECT:  ",null,{"$f":"Computations!C4","v":0},null,null,null,"COMPUTED BY:",null,{"$f":"Computations!O3","v":0},null,null,"CHECKED BY:",null,{"$f":"Computations!O6","v":0}]
["From:",{"$f":"Computations!C7","v":0},null,null,null,null,null,"DATE:  ",{"$f":"Computations!O4","v":"00:00:00"},null,null,null,"DATE:  ",{"$f":"Computations!O7","v":"00:00:00"},null,null,"Sheet",{"$f":"Computations!O9","v":1}]
["To:  ",{"$f":"Computations!C8","v":0},null,null,null,null,null,null,null,null,null,null,null,null,null,null,"of",{"$f":"Computations!Q9","v":1}]
[]
["LOCATION",null,"GUTTER DISCHARGE",null,null,null,null,"GUTTER DISCHARGE",null,null,null,null,null,null,null,"INLET DISCHARGE"]
[null,null,"Design Frequency:",null,null,{"$f":"Computations!H3","v":100},"yrs.","Allowable Spread:",null,null,{"$f":"Computations!M17","v":6},"feet"]
[]
[null,null,null,"Run-","Time","Rain",null,null,null,"Prev.","Total"]
[null,null,"Drain","off","of","Inten-",null,null,"Cross","Run-","Gutt.","Depth","Gutt.",null,null,"Inlet","Inter-","Run-"]
[null,null,"Area","Coef.","Conc.","sity","Q","Grade","Slope","by","Flow","d","Width","Sprd.",null,"Type","cept","by","Remarks"]
["Inlet",null,"A","C","Tc","I","CIA","So","Sx",null,null,"T/W","W","T","W/T",null,"Qi","Qr"]
["No.","Station","(ac.)",null,"(min.)","(in/hr)","(cfs)","(ft/ft)","(ft/ft)","(cfs)","(cfs)","(ft)","(ft)","(ft)",null,null,"(cfs)","(cfs)"]
[1,2,3,4,5,6,7,8,9,10,11,12,13,14,15,16,17,18,19]
[{"$f":"IF(ISBLANK(Computations!B17),\" \",Computations!B17)","v":224},{"$f":"IF(ISBLANK(Computations!C17),\" \",Computations!C17)","v":3110},{"$f":"IF(ISBLANK(Computations!B17),\" \",Computations!P17)","v":5.9700000000000003E-2},{"$f":"IF(Computations!P17<=0,\" \",Computations!Q17/Computations!P17)","v":0.8},{"$f":"IF(ISBLANK(Computations!B17),\" \",MAX(5,Computations!H17))","v":5},{"$f":"IF(ISBLANK(Computations!B17),\" \",Computations!R17)","v":7.33},{"$f":"IF(ISBLANK(Computations!B17),\" \",Computations!S17)","v":0.35008080000000003},{"$f":"IF(ISBLANK(Computations!$B17),\" \",Computations!I17)","v":7.0000000000000001E-3},{"$f":"IF(ISBLANK(Computations!$B17),\" \",Computations!J17)","v":0.02},{"$f":"IF(ISBLANK(Computations!$B17),\" \",Computations!AH16)","v":0},{"$f":"IF(ISBLANK(Computations!$B17),\" \",Computations!AA17)","v":0.24078200014464793},{"$f":"IF(ISBLANK(Computations!$B17),\" \",Computations!V17)","v":9.6215820312499992E-2},{"$f":"IF(ISBLANK(Computations!$B17),\" \",Computations!L17)","v":2},{"$f":"IF(ISBLANK(Computations!$B17),\" \",Computations!T17)","v":4.810791015625},{"$f":"IF(ISBLANK(Computations!$B17),\" \",M14/N14)","v":0.41573204770362854},{"$f":"IF(ISBLANK(Computations!$B17),\" \",Computations!N17)","v":15},{"$f":"IF(ISBLANK(Computations!$B17),\" \",Computations!AG17)","v":0.3036906975446253},{"$f":"IF(ISBLANK(Computations!$B17),\" \",Computations!AH17)","v":4.6390102455374727E-2}]
[{"$f":"IF(ISBLANK(Computations!B18),\" \",Computations!B18)","v":" "},{"$f":"IF(ISBLANK(Computations!C18),\" \",Computations!C18)","v":" "},{"$f":"IF(ISBLANK(Computations!B18),\" \",Computations!P18)","v":" "},{"$f":"IF(Computations!P18<=0,\" \",Computations!Q18/Computations!P18)","v":" "},{"$f":"IF(ISBLANK(Computations!B18),\" \",MAX(5,Computations!H18))","v":" "},{"$f":"IF(ISBLANK(Computations!B18),\" \",Computations!R18)","v":" "},{"$f":"IF(ISBLANK(Computations!B18),\" \",Computations!S18)","v":" "},{"$f":"IF(ISBLANK(Computations!B18),\" \",Computations!I18)","v":" "},{"$f":"IF(ISBLANK(Computations!$B18),\" \",Computations!J18)","v":" "},{"$f":"IF(ISBLANK(Computations!$B18),\" \",Computations!AH17)","v":" "},{"$f":"IF(ISBLANK(Computations!$B18),\" \",Computations!AA18)","v":" "},{"$f":"IF(ISBLANK(Computations!$B18),\" \",Computations!V18)","v":" "},{"$f":"IF(ISBLANK(Computations!$B18),\" \",Computations!L18)","v":" "},{"$f":"IF(ISBLANK(Computations!$B18),\" \",Computations!T18)","v":" "},{"$f":"IF(ISBLANK(Computations!$B18),\" \",M15/N15)","v":" "},{"$f":"IF(ISBLANK(Computations!$B18),\" \",Computations!N18)","v":" "},{"$f":"IF(ISBLANK(Computations!$B18),\" \",Computations!AG18)","v":" "},{"$f":"IF(ISBLANK(Computations!$B18),\" \",Computations!AH18)","v":" "}]
[{"$f":"IF(ISBLANK(Computations!B19),\" \",Computations!B19)","v":" "},{"$f":"IF(ISBLANK(Computations!C19),\" \",Computations!C19)","v":" "},{"$f":"IF(ISBLANK(Computations!B19),\" \",Computations!P19)","v":" "},{"$f":"IF(Computations!P19<=0,\" \",Computations!Q19/Computations!P19)","v":" "},{"$f":"IF(ISBLANK(Computations!B19),\" \",MAX(5,Computations!H19))","v":" "},{"$f":"IF(ISBLANK(Computations!B19),\" \",Computations!R19)","v":" "},{"$f":"IF(ISBLANK(Computations!B19),\" \",Computations!S19)","v":" "},{"$f":"IF(ISBLANK(Computations!B19),\" \",Computations!I19)","v":" "},{"$f":"IF(ISBLANK(Computations!$B19),\" \",Computations!J19)","v":" "},{"$f":"IF(ISBLANK(Computations!$B19),\" \",Computations!AH18)","v":" "},{"$f":"IF(ISBLANK(Computations!$B19),\" \",Computations!AA19)","v":" "},{"$f":"IF(ISBLANK(Computations!$B19),\" \",Computations!V19)","v":" "},{"$f":"IF(ISBLANK(Computations!$B19),\" \",Computations!L19)","v":" "},{"$f":"IF(ISBLANK(Computations!$B19),\" \",Computations!T19)","v":" "},{"$f":"IF(ISBLANK(Computations!$B19),\" \",M16/N16)","v":" "},{"$f":"IF(ISBLANK(Computations!$B19),\" \",Computations!N19)","v":" "},{"$f":"IF(ISBLANK(Computations!$B19),\" \",Computations!AG19)","v":" "},{"$f":"IF(ISBLANK(Computations!$B19),\" \",Computations!AH19)","v":" "}]
[{"$f":"IF(ISBLANK(Computations!B20),\" \",Computations!B20)","v":" "},{"$f":"IF(ISBLANK(Computations!C20),\" \",Computations!C20)","v":" "},{"$f":"IF(ISBLANK(Computations!B20),\" \",Computations!P20)","v":" "},{"$f":"IF(Computations!P20<=0,\" \",Computations!Q20/Computations!P20)","v":" "},{"$f":"IF(ISBLANK(Computations!B20),\" \",MAX(5,Computations!H20))","v":" "},{"$f":"IF(ISBLANK(Computations!B20),\" \",Computations!R20)","v":" "},{"$f":"IF(ISBLANK(Computations!B20),\" \",Computations!S20)","v":" "},{"$f":"IF(ISBLANK(Computations!B20),\" \",Computations!I20)","v":" "},{"$f":"IF(ISBLANK(Computations!$B20),\" \",Computations!J20)","v":" "},{"$f":"IF(ISBLANK(Computations!$B20),\" \",Computations!AH19)","v":" "},{"$f":"IF(ISBLANK(Computations!$B20),\" \",Computations!AA20)","v":" "},{"$f":"IF(ISBLANK(Computations!$B20),\" \",Computations!V20)","v":" "},{"$f":"IF(ISBLANK(Computations!$B20),\" \",Computations!L20)","v":" "},{"$f":"IF(ISBLANK(Computations!$B20),\" \",Computations!T20)","v":" "},{"$f":"IF(ISBLANK(Computations!$B20),\" \",M17/N17)","v":" "},{"$f":"IF(ISBLANK(Computations!$B20),\" \",Computations!N20)","v":" "},{"$f":"IF(ISBLANK(Computations!$B20),\" \",Computations!AG20)","v":" "},{"$f":"IF(ISBLANK(Computations!$B20),\" \",Computations!AH20)","v":" "}]
[{"$f":"IF(ISBLANK(Computations!B21),\" \",Computations!B21)","v":" "},{"$f":"IF(ISBLANK(Computations!C21),\" \",Computations!C21)","v":" "},{"$f":"IF(ISBLANK(Computations!B21),\" \",Computations!P21)","v":" "},{"$f":"IF(Computations!P21<=0,\" \",Computations!Q21/Computations!P21)","v":" "},{"$f":"IF(ISBLANK(Computations!B21),\" \",MAX(5,Computations!H21))","v":" "},{"$f":"IF(ISBLANK(Computations!B21),\" \",Computations!R21)","v":" "},{"$f":"IF(ISBLANK(Computations!B21),\" \",Computations!S21)","v":" "},{"$f":"IF(ISBLANK(Computations!B21),\" \",Computations!I21)","v":" "},{"$f":"IF(ISBLANK(Computations!$B21),\" \",Computations!J21)","v":" "},{"$f":"IF(ISBLANK(Computations!$B21),\" \",Computations!AH20)","v":" "},{"$f":"IF(ISBLANK(Computations!$B21),\" \",Computations!AA21)","v":" "},{"$f":"IF(ISBLANK(Computations!$B21),\" \",Computations!V21)","v":" "},{"$f":"IF(ISBLANK(Computations!$B21),\" \",Computations!L21)","v":" "},{"$f":"IF(ISBLANK(Computations!$B21),\" \",Computations!T21)","v":" "},{"$f":"IF(ISBLANK(Computations!$B21),\" \",M18/N18)","v":" "},{"$f":"IF(ISBLANK(Computations!$B21),\" \",Computations!N21)","v":" "},{"$f":"IF(ISBLANK(Computations!$B21),\" \",Computations!AG21)","v":" "},{"$f":"IF(ISBLANK(Computations!$B21),\" \",Computations!AH21)","v":" "}]
[{"$f":"IF(ISBLANK(Computations!B22),\" \",Computations!B22)","v":" "},{"$f":"IF(ISBLANK(Computations!C22),\" \",Computations!C22)","v":" "},{"$f":"IF(ISBLANK(Computations!B22),\" \",Computations!P22)","v":" "},{"$f":"IF(Computations!P22<=0,\" \",Computations!Q22/Computations!P22)","v":" "},{"$f":"IF(ISBLANK(Computations!B22),\" \",MAX(5,Computations!H22))","v":" "},{"$f":"IF(ISBLANK(Computations!B22),\" \",Computations!R22)","v":" "},{"$f":"IF(ISBLANK(Computations!B22),\" \",Computations!S22)","v":" "},{"$f":"IF(ISBLANK(Computations!B22),\" \",Computations!I22)","v":" "},{"$f":"IF(ISBLANK(Computations!$B22),\" \",Computations!J22)","v":" "},{"$f":"IF(ISBLANK(Computations!$B22),\" \",Computations!AH21)","v":" "},{"$f":"IF(ISBLANK(Computations!$B22),\" \",Computations!AA22)","v":" "},{"$f":"IF(ISBLANK(Computations!$B22),\" \",Computations!V22)","v":" "},{"$f":"IF(ISBLANK(Computations!$B22),\" \",Computations!L22)","v":" "},{"$f":"IF(ISBLANK(Computations!$B22),\" \",Computations!T22)","v":" "},{"$f":"IF(ISBLANK(Computations!$B22),\" \",M19/N19)","v":" "},{"$f":"IF(ISBLANK(Computations!$B22),\" \",Computations!N22)","v":" "},{"$f":"IF(ISBLANK(Computations!$B22),\" \",Computations!AG22)","v":" "},{"$f":"IF(ISBLANK(Computations!$B22),\" \",Computations!AH22)","v":" "}]
[{"$f":"IF(ISBLANK(Computations!B23),\" \",Computations!B23)","v":" "},{"$f":"IF(ISBLANK(Computations!C23),\" \",Computations!C23)","v":" "},{"$f":"IF(ISBLANK(Computations!B23),\" \",Computations!P23)","v":" "},{"$f":"IF(Computations!P23<=0,\" \",Computations!Q23/Computations!P23)","v":" "},{"$f":"IF(ISBLANK(Computations!B23),\" \",MAX(5,Computations!H23))","v":" "},{"$f":"IF(ISBLANK(Computations!B23),\" \",Computations!R23)","v":" "},{"$f":"IF(ISBLANK(Computations!B23),\" \",Computations!S23)","v":" "},{"$f":"IF(ISBLANK(Computations!B23),\" \",Computations!I23)","v":" "},{"$f":"IF(ISBLANK(Computations!$B23),\" \",Computations!J23)","v":" "},{"$f":"IF(ISBLANK(Computations!$B23),\" \",Computations!AH22)","v":" "},{"$f":"IF(ISBLANK(Computations!$B23),\" \",Computations!AA23)","v":" "},{"$f":"IF(ISBLANK(Computations!$B23),\" \",Computations!V23)","v":" "},{"$f":"IF(ISBLANK(Computations!$B23),\" \",Computations!L23)","v":" "},{"$f":"IF(ISBLANK(Computations!$B23),\" \",Computations!T23)","v":" "},{"$f":"IF(ISBLANK(Computations!$B23),\" \",M20/N20)","v":" "},{"$f":"IF(ISBLANK(Computations!$B23),\" \",Computations!N23)","v":" "},{"$f":"IF(ISBLANK(Computations!$B23),\" \",Computations!AG23)","v":" "},{"$f":"IF(ISBLANK(Computations!$B23),\" \",Computations!AH23)","v":" "}]
{"$rows_left_out":16}
{"sheet":"Lookup Tables","index":3,"n_rows":17,"n_cols":16,"rows_kept":17,"cut":false,"hidden":false,"merged":[]}
[]
[]
[null,"DATA ON INLET GRATES (this data is used)",null,null,null,null,null,null,null,null,null,"DATA ON INLET GRATES (NO CLOGGING):"]
[]
[null,null,"Width","Length","Vo",null,null,null,null,null,null,null,"Width","Length","Vo"]
[null,"Type","(feet)","(feet)","(fps)","Notes",null,null,null,null,null,"Type","(feet)","(feet)","(fps)"]
[null," "," "," "," ",null,null,null,null,null,null," "," "," "," "]
[null,3,0.01,2,0.01,"Side flow only"]
[null,5,1.7,{"$f":"N9/2","v":1.895},5.63,"model as clogged",null,null,null,null,null,5,1.7,3.79,8.5500000000000007,"curved"]
[null,6,1.33,{"$f":"N10/2","v":1.5},3.37,"model as clogged",null,null,null,null,null,6,1.33,3,5.72,"reticuline"]
[null,8,1.1299999999999999,1.8,5.54,"has cub box",null,null,null,null,null,8,1.1299999999999999,1.8,5.54,"curved"]
[null,10,1.1299999999999999,2.88,7.33,"has cub box",null,null,null,null,null,10,1.1299999999999999,2.88,7.33,"curved"]
[null,13,1.4,{"$f":"N13/2","v":1.24},2.87,"model as clogged",null,null,null,null,null,13,1.4,2.48,4.96,"reticuline"]
[null,14,1.21,{"$f":"N14/2","v":2.46},4.93,"model as clogged",null,null,null,null,null,14,1.21,4.92,8.36,"reticuline"]
[null,15,1.7,3.79,8.58,"has cub box",null,null,null,null,null,15,1.7,3.79,8.58,"curved"]
[null,"OS",1.58,{"$f":"N16/2","v":0.83499999999999996},3.44,"model as clogged",null,null,null,null,null,"OS",1.58,1.67,3.66,"reticuline"]
[null,"SQ",1.58,{"$f":"N17/2","v":0.79},3.31,"model as clogged",null,null,null,null,null,"SQ",1.58,1.58,3.5,"reticuline"]