{"text_format":"1","workbook":"xlsx","n_sheets":9,"sheets":["Instructions","Detail","Attendance","Summary","Composition","Alternate or Potential Members","Committees","Trainings","Formulas"],"not_rendered":{"charts":0,"images":1,"macros":1,"external_links":0,"defined_names":9,"comments":0,"pivot_tables":0},"unopened":[],"bounds":{"document_bytes":16777216,"sheet_cells":100000,"rows_first":2000,"rows_last":500,"rows_between":2000,"halvings":0,"cell_chars":16384,"cell_head_chars":4096},"cells_cut":0,"cells_raw":0,"read":"whole","date_system":"1900"}

{"sheet":"Instructions","index":0,"n_rows":16,"n_cols":4,"rows_kept":16,"cut":false,"hidden":false,"merged":[[7,2,7,3],[2,2,2,5],[1,2,1,8],[3,2,3,8],[4,2,4,8],[5,2,5,8]]}
[]
[null,null,"Board Governance Management Tool"]
[]
[null,null,"     The Board Governance Management Tool is designed to aid the agency in overseeing the different aspects associated with community action governing board members. The intent of this multi-use tool is to provide the agency's executive leadership team and the specific board commitee who oversee these responsibilities the ability to effectively manage these aspects within one governance tool."]
[null,null,"     The use of this tool is not mandated, nor does its completion ensure compliance with the Office of Community Services (OCS) Informational memorandum (IM) 138 Organizational Standards or IHCDA's Community Service Block Grant (CSBG) Comprehensive Administrative Review (CAR) Monitoring.  However, it will be a valuable indicator of possible action the agency must take to remain compliant."]
[null,null,"If you have any questions regarding this tool, please email the CSBG monitor."]
{"$rows_left_out":11}
{"sheet":"Detail","index":1,"n_rows":50,"n_cols":37,"rows_kept":50,"cut":false,"hidden":false,"merged":[[1,17,2,17],[1,20,1,40],[2,20,2,30],[2,31,2,40],[1,18,2,18],[1,19,2,19],[1,1,2,1],[1,4,2,4],[1,6,2,6],[1,11,2,11],[1,16,2,16],[1,13,2,13],[1,14,2,14],[1,15,2,15],[1,2,2,2],[1,3,2,3],[1,7,2,7],[1,8,2,8],[1,10,2,10],[1,12,2,12],[1,5,2,5],[1,9,2,9]]}
[]
[null,"Name","Active?","County ","Sector of Representation","For Use w/ Public Representative Only","Cell Phone","Home Phone ","Address ","City","Zip Code","Email","Does Member Have an Outlook Calendar?","Voted on by Board ","Term End","Signed Orientation Documentation ","Most Recent Bylaws Received ","Most recent Signed Conflict of Interest ","User Defined\n(agency use only)","User Defined\n(agency use only)","Taken from \"CAPLAW Sample CAA Board Composition Matrix  April 2012\""]
[null,null,null,null,null,null,null,null,null,null,null,null,null,null,null,null,null,null,null,null,"Skill/Experience/Expertise",null,null,null,null,null,null,null,null,null,null,"Access/Connections"]
[null,"Add Only Seated Members (No Alternates or Other Designees)","Yes (Y) or No (N) ","Enter County of Residence","Low-income (L)\n\nPublic (P)\n\nCommunity (C) \n(Private)","If Public Representative, Enter Represented Office","Enter Number","Enter Number","Enter Street Address",null,null,"Enter Confirmed Email Address","Yes (Y) or No (N) ","Date","Current Term End Date","Date","Date","Date\n(recommend annually)","User Defined\n(agency use only)","User Defined\n(agency use only)","  P.R. Communications","  Financial Planning/Management","  Organizational Management","  H.R. Management","  Fundraising","  Early childhood education & development","  Attorney",null,null,null,null,"  Foundations","  Wealthy Individuals","  Business/Corporations","  Politics/Government","  Religious Community","  Grassroots Constitutents"]
[]
[]
{"$rows_left_out":45}
{"sheet":"Attendance","index":2,"n_rows":58,"n_cols":35,"rows_kept":58,"cut":false,"hidden":false,"merged":[[55,2,55,5],[56,2,56,10],[57,2,57,7],[47,1,47,2],[51,1,51,2],[1,1,42,1],[49,1,49,2],[44,1,44,2],[45,1,45,2],[46,1,46,2]]}
[]
[null,"Board Attendance",null,"Jan","Feb","Mar","Apr","May","Jun","Jul","Aug","Sep","Oct","Nov","Dec","TOTAL MEEETINGS ATTENDED PER PERSON","% ATTENDANCE PER PERSON",null,null,null,null,null,null,"Jan","Feb","Mar","Apr","May","Jun","Jul","Aug","Sep","Oct","Nov","Dec"]
[null,null,"Name","Enter Date","Enter Date","Enter Date","Enter Date","Enter Date","Enter Date","Enter Date","Enter Date","Enter Date","Enter Date","Enter Date","Enter Date",null,null,null,"CHART KEY:",null,null,null,null,"2019-01-01","2019-02-01","2019-03-02","2019-04-03",null,"2019-06-05","2019-07-06","2019-07-23","2019-08-23"]
[null,null,{"$f":"IF(ISBLANK(Detail!B5),\"\",Detail!B5)","v":""},null,null,null,null,null,null,null,null,null,null,null,null,{"$f":"IF(COUNTIFS(D4:O4,\"P\")+COUNTIFS(D4:O4,\"PC\")+COUNTIFS(D4:O4,\"E\")+COUNTIFS(D4:O4,\"X\")+COUNTIFS(D4:O4,\"S\")=0,\"\",COUNTIFS(D4:O4,\"P\")+COUNTIFS(D4:O4,\"PC\")+COUNTIFS(D4:O4,\"S\"))","v":""},{"$f":"IFERROR(IF(P4=\"\",\"\",P4/(SUMPRODUCT(--NOT(ISBLANK(D4:O4)))-COUNTIF(D4:O4,\"NS\"))),\"\")","v":""},null,"P","Present ",null,null,{"$f":"IF(P4=\"\",\"\",P4/(SUMPRODUCT(--NOT(ISBLANK(D4:O4)))-COUNTIF(D4:O4,\"NS\")))","v":""},{"$f":"IF(D4=\"P\",VLOOKUP($C4,Detail!$B$4:$E$44,4,FALSE),IF(D4=\"PC\",VLOOKUP($C4,Detail!$B$4:$E$44,4,FALSE),IF(D4=\"E\",VLOOKUP($C4,Detail!$B$4:$E$44,4,FALSE),IF(D4=\"X\",VLOOKUP($C4,Detail!$B$4:$E$44,4,FALSE),IF(D4=\"S\",VLOOKUP($C4,Detail!$B$4:$E$44,4,FALSE),\"\")))))","v":""},{"$f":"IF(E4=\"P\",VLOOKUP($C4,Detail!$B$4:$E$44,4,FALSE),IF(E4=\"PC\",VLOOKUP($C4,Detail!$B$4:$E$44,4,FALSE),IF(E4=\"E\",VLOOKUP($C4,Detail!$B$4:$E$44,4,FALSE),IF(E4=\"X\",VLOOKUP($C4,Detail!$B$4:$E$44,4,FALSE),IF(E4=\"S\",VLOOKUP($C4,Detail!$B$4:$E$44,4,FALSE),\"\")))))","v":""},{"$f":"IF(F4=\"P\",VLOOKUP($C4,Detail!$B$4:$E$44,4,FALSE),IF(F4=\"PC\",VLOOKUP($C4,Detail!$B$4:$E$44,4,FALSE),IF(F4=\"E\",VLOOKUP($C4,Detail!$B$4:$E$44,4,FALSE),IF(F4=\"X\",VLOOKUP($C4,Detail!$B$4:$E$44,4,FALSE),IF(F4=\"S\",VLOOKUP($C4,Detail!$B$4:$E$44,4,FALSE),\"\")))))","v":""},{"$f":"IF(G4=\"P\",VLOOKUP($C4,Detail!$B$4:$E$44,4,FALSE),IF(G4=\"PC\",VLOOKUP($C4,Detail!$B$4:$E$44,4,FALSE),IF(G4=\"E\",VLOOKUP($C4,Detail!$B$4:$E$44,4,FALSE),IF(G4=\"X\",VLOOKUP($C4,Detail!$B$4:$E$44,4,FALSE),IF(G4=\"S\",VLOOKUP($C4,Detail!$B$4:$E$44,4,FALSE),\"\")))))","v":""},{"$f":"IF(H4=\"P\",VLOOKUP($C4,Detail!$B$4:$E$44,4,FALSE),IF(H4=\"PC\",VLOOKUP($C4,Detail!$B$4:$E$44,4,FALSE),IF(H4=\"E\",VLOOKUP($C4,Detail!$B$4:$E$44,4,FALSE),IF(H4=\"X\",VLOOKUP($C4,Detail!$B$4:$E$44,4,FALSE),IF(H4=\"S\",VLOOKUP($C4,Detail!$B$4:$E$44,4,FALSE),\"\")))))","v":""},{"$f":"IF(I4=\"P\",VLOOKUP($C4,Detail!$B$4:$E$44,4,FALSE),IF(I4=\"PC\",VLOOKUP($C4,Detail!$B$4:$E$44,4,FALSE),IF(I4=\"E\",VLOOKUP($C4,Detail!$B$4:$E$44,4,FALSE),IF(I4=\"X\",VLOOKUP($C4,Detail!$B$4:$E$44,4,FALSE),IF(I4=\"S\",VLOOKUP($C4,Detail!$B$4:$E$44,4,FALSE),\"\")))))","v":""},{"$f":"IF(J4=\"P\",VLOOKUP($C4,Detail!$B$4:$E$44,4,FALSE),IF(J4=\"PC\",VLOOKUP($C4,Detail!$B$4:$E$44,4,FALSE),IF(J4=\"E\",VLOOKUP($C4,Detail!$B$4:$E$44,4,FALSE),IF(J4=\"X\",VLOOKUP($C4,Detail!$B$4:$E$44,4,FALSE),IF(J4=\"S\",VLOOKUP($C4,Detail!$B$4:$E$44,4,FALSE),\"\")))))","v":""},{"$f":"IF(K4=\"P\",VLOOKUP($C4,Detail!$B$4:$E$44,4,FALSE),IF(K4=\"PC\",VLOOKUP($C4,Detail!$B$4:$E$44,4,FALSE),IF(K4=\"E\",VLOOKUP($C4,Detail!$B$4:$E$44,4,FALSE),IF(K4=\"X\",VLOOKUP($C4,Detail!$B$4:$E$44,4,FALSE),IF(K4=\"S\",VLOOKUP($C4,Detail!$B$4:$E$44,4,FALSE),\"\")))))","v":""},{"$f":"IF(L4=\"P\",VLOOKUP($C4,Detail!$B$4:$E$44,4,FALSE),IF(L4=\"PC\",VLOOKUP($C4,Detail!$B$4:$E$44,4,FALSE),IF(L4=\"E\",VLOOKUP($C4,Detail!$B$4:$E$44,4,FALSE),IF(L4=\"X\",VLOOKUP($C4,Detail!$B$4:$E$44,4,FALSE),IF(L4=\"S\",VLOOKUP($C4,Detail!$B$4:$E$44,4,FALSE),\"\")))))","v":""},{"$f":"IF(M4=\"P\",VLOOKUP($C4,Detail!$B$4:$E$44,4,FALSE),IF(M4=\"PC\",VLOOKUP($C4,Detail!$B$4:$E$44,4,FALSE),IF(M4=\"E\",VLOOKUP($C4,Detail!$B$4:$E$44,4,FALSE),IF(M4=\"X\",VLOOKUP($C4,Detail!$B$4:$E$44,4,FALSE),IF(M4=\"S\",VLOOKUP($C4,Detail!$B$4:$E$44,4,FALSE),\"\")))))","v":""},{"$f":"IF(N4=\"P\",VLOOKUP($C4,Detail!$B$4:$E$44,4,FALSE),IF(N4=\"PC\",VLOOKUP($C4,Detail!$B$4:$E$44,4,FALSE),IF(N4=\"E\",VLOOKUP($C4,Detail!$B$4:$E$44,4,FALSE),IF(N4=\"X\",VLOOKUP($C4,Detail!$B$4:$E$44,4,FALSE),IF(N4=\"S\",VLOOKUP($C4,Detail!$B$4:$E$44,4,FALSE),\"\")))))","v":""},{"$f":"IF(O4=\"P\",VLOOKUP($C4,Detail!$B$4:$E$44,4,FALSE),IF(O4=\"PC\",VLOOKUP($C4,Detail!$B$4:$E$44,4,FALSE),IF(O4=\"E\",VLOOKUP($C4,Detail!$B$4:$E$44,4,FALSE),IF(O4=\"X\",VLOOKUP($C4,Detail!$B$4:$E$44,4,FALSE),IF(O4=\"S\",VLOOKUP($C4,Detail!$B$4:$E$44,4,FALSE),\"\")))))","v":""}]
[null,null,{"$f":"IF(ISBLANK(Detail!B6),\"\",Detail!B6)","v":""},null,null,null,null,null,null,null,null,null,null,null,null,{"$f":"IF(COUNTIFS(D5:O5,\"P\")+COUNTIFS(D5:O5,\"PC\")+COUNTIFS(D5:O5,\"E\")+COUNTIFS(D5:O5,\"X\")+COUNTIFS(D5:O5,\"S\")=0,\"\",COUNTIFS(D5:O5,\"P\")+COUNTIFS(D5:O5,\"PC\")+COUNTIFS(D5:O5,\"S\"))","v":""},{"$f":"IFERROR(IF(P5=\"\",\"\",P5/(SUMPRODUCT(--NOT(ISBLANK(D5:O5)))-COUNTIF(D5:O5,\"NS\"))),\"\")","v":""},null,"PC","Present via Call/Videochat",null,null,{"$f":"IF(P5=\"\",\"\",P5/(SUMPRODUCT(--NOT(ISBLANK(D5:O5)))-COUNTIF(D5:O5,\"NS\")))","v":""},{"$f":"IF(D5=\"P\",VLOOKUP($C5,Detail!$B$4:$E$44,4,FALSE),IF(D5=\"PC\",VLOOKUP($C5,Detail!$B$4:$E$44,4,FALSE),IF(D5=\"E\",VLOOKUP($C5,Detail!$B$4:$E$44,4,FALSE),IF(D5=\"X\",VLOOKUP($C5,Detail!$B$4:$E$44,4,FALSE),IF(D5=\"S\",VLOOKUP($C5,Detail!$B$4:$E$44,4,FALSE),\"\")))))","v":""},{"$f":"IF(E5=\"P\",VLOOKUP($C5,Detail!$B$4:$E$44,4,FALSE),IF(E5=\"PC\",VLOOKUP($C5,Detail!$B$4:$E$44,4,FALSE),IF(E5=\"E\",VLOOKUP($C5,Detail!$B$4:$E$44,4,FALSE),IF(E5=\"X\",VLOOKUP($C5,Detail!$B$4:$E$44,4,FALSE),IF(E5=\"S\",VLOOKUP($C5,Detail!$B$4:$E$44,4,FALSE),\"\")))))","v":""},{"$f":"IF(F5=\"P\",VLOOKUP($C5,Detail!$B$4:$E$44,4,FALSE),IF(F5=\"PC\",VLOOKUP($C5,Detail!$B$4:$E$44,4,FALSE),IF(F5=\"E\",VLOOKUP($C5,Detail!$B$4:$E$44,4,FALSE),IF(F5=\"X\",VLOOKUP($C5,Detail!$B$4:$E$44,4,FALSE),IF(F5=\"S\",VLOOKUP($C5,Detail!$B$4:$E$44,4,FALSE),\"\")))))","v":""},{"$f":"IF(G5=\"P\",VLOOKUP($C5,Detail!$B$4:$E$44,4,FALSE),IF(G5=\"PC\",VLOOKUP($C5,Detail!$B$4:$E$44,4,FALSE),IF(G5=\"E\",VLOOKUP($C5,Detail!$B$4:$E$44,4,FALSE),IF(G5=\"X\",VLOOKUP($C5,Detail!$B$4:$E$44,4,FALSE),IF(G5=\"S\",VLOOKUP($C5,Detail!$B$4:$E$44,4,FALSE),\"\")))))","v":""},{"$f":"IF(H5=\"P\",VLOOKUP($C5,Detail!$B$4:$E$44,4,FALSE),IF(H5=\"PC\",VLOOKUP($C5,Detail!$B$4:$E$44,4,FALSE),IF(H5=\"E\",VLOOKUP($C5,Detail!$B$4:$E$44,4,FALSE),IF(H5=\"X\",VLOOKUP($C5,Detail!$B$4:$E$44,4,FALSE),IF(H5=\"S\",VLOOKUP($C5,Detail!$B$4:$E$44,4,FALSE),\"\")))))","v":""},{"$f":"IF(I5=\"P\",VLOOKUP($C5,Detail!$B$4:$E$44,4,FALSE),IF(I5=\"PC\",VLOOKUP($C5,Detail!$B$4:$E$44,4,FALSE),IF(I5=\"E\",VLOOKUP($C5,Detail!$B$4:$E$44,4,FALSE),IF(I5=\"X\",VLOOKUP($C5,Detail!$B$4:$E$44,4,FALSE),IF(I5=\"S\",VLOOKUP($C5,Detail!$B$4:$E$44,4,FALSE),\"\")))))","v":""},{"$f":"IF(J5=\"P\",VLOOKUP($C5,Detail!$B$4:$E$44,4,FALSE),IF(J5=\"PC\",VLOOKUP($C5,Detail!$B$4:$E$44,4,FALSE),IF(J5=\"E\",VLOOKUP($C5,Detail!$B$4:$E$44,4,FALSE),IF(J5=\"X\",VLOOKUP($C5,Detail!$B$4:$E$44,4,FALSE),IF(J5=\"S\",VLOOKUP($C5,Detail!$B$4:$E$44,4,FALSE),\"\")))))","v":""},{"$f":"IF(K5=\"P\",VLOOKUP($C5,Detail!$B$4:$E$44,4,FALSE),IF(K5=\"PC\",VLOOKUP($C5,Detail!$B$4:$E$44,4,FALSE),IF(K5=\"E\",VLOOKUP($C5,Detail!$B$4:$E$44,4,FALSE),IF(K5=\"X\",VLOOKUP($C5,Detail!$B$4:$E$44,4,FALSE),IF(K5=\"S\",VLOOKUP($C5,Detail!$B$4:$E$44,4,FALSE),\"\")))))","v":""},{"$f":"IF(L5=\"P\",VLOOKUP($C5,Detail!$B$4:$E$44,4,FALSE),IF(L5=\"PC\",VLOOKUP($C5,Detail!$B$4:$E$44,4,FALSE),IF(L5=\"E\",VLOOKUP($C5,Detail!$B$4:$E$44,4,FALSE),IF(L5=\"X\",VLOOKUP($C5,Detail!$B$4:$E$44,4,FALSE),IF(L5=\"S\",VLOOKUP($C5,Detail!$B$4:$E$44,4,FALSE),\"\")))))","v":""},{"$f":"IF(M5=\"P\",VLOOKUP($C5,Detail!$B$4:$E$44,4,FALSE),IF(M5=\"PC\",VLOOKUP($C5,Detail!$B$4:$E$44,4,FALSE),IF(M5=\"E\",VLOOKUP($C5,Detail!$B$4:$E$44,4,FALSE),IF(M5=\"X\",VLOOKUP($C5,Detail!$B$4:$E$44,4,FALSE),IF(M5=\"S\",VLOOKUP($C5,Detail!$B$4:$E$44,4,FALSE),\"\")))))","v":""},{"$f":"IF(N5=\"P\",VLOOKUP($C5,Detail!$B$4:$E$44,4,FALSE),IF(N5=\"PC\",VLOOKUP($C5,Detail!$B$4:$E$44,4,FALSE),IF(N5=\"E\",VLOOKUP($C5,Detail!$B$4:$E$44,4,FALSE),IF(N5=\"X\",VLOOKUP($C5,Detail!$B$4:$E$44,4,FALSE),IF(N5=\"S\",VLOOKUP($C5,Detail!$B$4:$E$44,4,FALSE),\"\")))))","v":""},{"$f":"IF(O5=\"P\",VLOOKUP($C5,Detail!$B$4:$E$44,4,FALSE),IF(O5=\"PC\",VLOOKUP($C5,Detail!$B$4:$E$44,4,FALSE),IF(O5=\"E\",VLOOKUP($C5,Detail!$B$4:$E$44,4,FALSE),IF(O5=\"X\",VLOOKUP($C5,Detail!$B$4:$E$44,4,FALSE),IF(O5=\"S\",VLOOKUP($C5,Detail!$B$4:$E$44,4,FALSE),\"\")))))","v":""}]
[null,null,{"$f":"IF(ISBLANK(Detail!B7),\"\",Detail!B7)","v":""},null,null,null,null,null,null,null,null,null,null,null,null,"","",null,"E","Excused",null,null,"",{"$f":"IF(D6=\"P\",VLOOKUP($C6,Detail!$B$4:$E$44,4,FALSE),IF(D6=\"PC\",VLOOKUP($C6,Detail!$B$4:$E$44,4,FALSE),IF(D6=\"E\",VLOOKUP($C6,Detail!$B$4:$E$44,4,FALSE),IF(D6=\"X\",VLOOKUP($C6,Detail!$B$4:$E$44,4,FALSE),IF(D6=\"S\",VLOOKUP($C6,Detail!$B$4:$E$44,4,FALSE),\"\")))))","v":""},{"$f":"IF(E6=\"P\",VLOOKUP($C6,Detail!$B$4:$E$44,4,FALSE),IF(E6=\"PC\",VLOOKUP($C6,Detail!$B$4:$E$44,4,FALSE),IF(E6=\"E\",VLOOKUP($C6,Detail!$B$4:$E$44,4,FALSE),IF(E6=\"X\",VLOOKUP($C6,Detail!$B$4:$E$44,4,FALSE),IF(E6=\"S\",VLOOKUP($C6,Detail!$B$4:$E$44,4,FALSE),\"\")))))","v":""},{"$f":"IF(F6=\"P\",VLOOKUP($C6,Detail!$B$4:$E$44,4,FALSE),IF(F6=\"PC\",VLOOKUP($C6,Detail!$B$4:$E$44,4,FALSE),IF(F6=\"E\",VLOOKUP($C6,Detail!$B$4:$E$44,4,FALSE),IF(F6=\"X\",VLOOKUP($C6,Detail!$B$4:$E$44,4,FALSE),IF(F6=\"S\",VLOOKUP($C6,Detail!$B$4:$E$44,4,FALSE),\"\")))))","v":""},{"$f":"IF(G6=\"P\",VLOOKUP($C6,Detail!$B$4:$E$44,4,FALSE),IF(G6=\"PC\",VLOOKUP($C6,Detail!$B$4:$E$44,4,FALSE),IF(G6=\"E\",VLOOKUP($C6,Detail!$B$4:$E$44,4,FALSE),IF(G6=\"X\",VLOOKUP($C6,Detail!$B$4:$E$44,4,FALSE),IF(G6=\"S\",VLOOKUP($C6,Detail!$B$4:$E$44,4,FALSE),\"\")))))","v":""},{"$f":"IF(H6=\"P\",VLOOKUP($C6,Detail!$B$4:$E$44,4,FALSE),IF(H6=\"PC\",VLOOKUP($C6,Detail!$B$4:$E$44,4,FALSE),IF(H6=\"E\",VLOOKUP($C6,Detail!$B$4:$E$44,4,FALSE),IF(H6=\"X\",VLOOKUP($C6,Detail!$B$4:$E$44,4,FALSE),IF(H6=\"S\",VLOOKUP($C6,Detail!$B$4:$E$44,4,FALSE),\"\")))))","v":""},{"$f":"IF(I6=\"P\",VLOOKUP($C6,Detail!$B$4:$E$44,4,FALSE),IF(I6=\"PC\",VLOOKUP($C6,Detail!$B$4:$E$44,4,FALSE),IF(I6=\"E\",VLOOKUP($C6,Detail!$B$4:$E$44,4,FALSE),IF(I6=\"X\",VLOOKUP($C6,Detail!$B$4:$E$44,4,FALSE),IF(I6=\"S\",VLOOKUP($C6,Detail!$B$4:$E$44,4,FALSE),\"\")))))","v":""},{"$f":"IF(J6=\"P\",VLOOKUP($C6,Detail!$B$4:$E$44,4,FALSE),IF(J6=\"PC\",VLOOKUP($C6,Detail!$B$4:$E$44,4,FALSE),IF(J6=\"E\",VLOOKUP($C6,Detail!$B$4:$E$44,4,FALSE),IF(J6=\"X\",VLOOKUP($C6,Detail!$B$4:$E$44,4,FALSE),IF(J6=\"S\",VLOOKUP($C6,Detail!$B$4:$E$44,4,FALSE),\"\")))))","v":""},{"$f":"IF(K6=\"P\",VLOOKUP($C6,Detail!$B$4:$E$44,4,FALSE),IF(K6=\"PC\",VLOOKUP($C6,Detail!$B$4:$E$44,4,FALSE),IF(K6=\"E\",VLOOKUP($C6,Detail!$B$4:$E$44,4,FALSE),IF(K6=\"X\",VLOOKUP($C6,Detail!$B$4:$E$44,4,FALSE),IF(K6=\"S\",VLOOKUP($C6,Detail!$B$4:$E$44,4,FALSE),\"\")))))","v":""},{"$f":"IF(L6=\"P\",VLOOKUP($C6,Detail!$B$4:$E$44,4,FALSE),IF(L6=\"PC\",VLOOKUP($C6,Detail!$B$4:$E$44,4,FALSE),IF(L6=\"E\",VLOOKUP($C6,Detail!$B$4:$E$44,4,FALSE),IF(L6=\"X\",VLOOKUP($C6,Detail!$B$4:$E$44,4,FALSE),IF(L6=\"S\",VLOOKUP($C6,Detail!$B$4:$E$44,4,FALSE),\"\")))))","v":""},{"$f":"IF(M6=\"P\",VLOOKUP($C6,Detail!$B$4:$E$44,4,FALSE),IF(M6=\"PC\",VLOOKUP($C6,Detail!$B$4:$E$44,4,FALSE),IF(M6=\"E\",VLOOKUP($C6,Detail!$B$4:$E$44,4,FALSE),IF(M6=\"X\",VLOOKUP($C6,Detail!$B$4:$E$44,4,FALSE),IF(M6=\"S\",VLOOKUP($C6,Detail!$B$4:$E$44,4,FALSE),\"\")))))","v":""},{"$f":"IF(N6=\"P\",VLOOKUP($C6,Detail!$B$4:$E$44,4,FALSE),IF(N6=\"PC\",VLOOKUP($C6,Detail!$B$4:$E$44,4,FALSE),IF(N6=\"E\",VLOOKUP($C6,Detail!$B$4:$E$44,4,FALSE),IF(N6=\"X\",VLOOKUP($C6,Detail!$B$4:$E$44,4,FALSE),IF(N6=\"S\",VLOOKUP($C6,Detail!$B$4:$E$44,4,FALSE),\"\")))))","v":""},{"$f":"IF(O6=\"P\",VLOOKUP($C6,Detail!$B$4:$E$44,4,FALSE),IF(O6=\"PC\",VLOOKUP($C6,Detail!$B$4:$E$44,4,FALSE),IF(O6=\"E\",VLOOKUP($C6,Detail!$B$4:$E$44,4,FALSE),IF(O6=\"X\",VLOOKUP($C6,Detail!$B$4:$E$44,4,FALSE),IF(O6=\"S\",VLOOKUP($C6,Detail!$B$4:$E$44,4,FALSE),\"\")))))","v":""}]
{"$rows_left_out":53}
{"sheet":"Summary","index":3,"n_rows":54,"n_cols":6,"rows_kept":54,"cut":false,"hidden":false,"merged":[[1,1,2,1],[11,5,12,5],[11,2,12,2],[11,3,12,3],[5,1,8,1],[11,1,12,1],[11,4,12,4]]}
[]
[null,"[IC-12-14-23-6]","Minimum # of Members","Current","Compliant?"]
[null,null,15,{"$f":"COUNTIF(Detail!C5:C44,\"Y\")","v":0},{"$f":"IF(D3=0,\"\",IF(D3>=C3,\"Yes\",\"No\"))","v":""}]
[]
[null,"TAB","Standard","Compliance"]
[null,"Detail","Voted on by Board",{"$f":"IF(COUNTA(Detail!B5:B44)=COUNTA(Detail!N5:N44),\"Yes\",\"No\")","v":"Yes"}]
{"$rows_left_out":49}
{"sheet":"Composition","index":4,"n_rows":45,"n_cols":9,"rows_kept":45,"cut":false,"hidden":false,"merged":[[1,1,2,8],[8,6,8,7],[3,1,3,3],[17,5,17,8]]}
[]
[null,"Tripartite Compliance Indicator Sheet"]
[]
[null,"Sector",null,null,null,"Type","Number","Composition","Compliant?"]
[null,"Low Income (Consumer)","Public Official","Community (Private)",null,"Low Income",{"$f":"SUMPRODUCT(--NOT(ISERROR(B6:B45)))","v":0},{"$f":"IF(G9=0,\"\",G5/G9)","v":""},{"$f":"IF(G9=0,\"\",IF(H5>=0.33,\"Yes\",\"No\"))","v":""}]
[null,{"$f":"VLOOKUP(Formulas!$K2,Formulas!$A$2:$B$41,2,FALSE)","v":{"$error":"#N/A"}},{"$f":"VLOOKUP(Formulas!$K2,Formulas!$C$2:$D$41,2,FALSE)","v":{"$error":"#N/A"}},{"$f":"VLOOKUP(Formulas!$K2,Formulas!$E$2:$F$41,2,FALSE)","v":{"$error":"#N/A"}},null,"Public",{"$f":"SUMPRODUCT(--NOT(ISERROR(C6:C45)))","v":0},{"$f":"IF(G9=0,\"\",G6/G9)","v":""},{"$f":"IF(G9=0,\"\",IF(G6>G5,\"No\",IF(G6/G9>=0.33,\"Yes\",\"No\")))","v":""}]
{"$rows_left_out":40}
{"sheet":"Alternate or Potential Members","index":5,"n_rows":6,"n_cols":37,"rows_kept":6,"cut":false,"hidden":false,"merged":[[1,12,1,32],[2,12,2,22],[2,23,2,32],[1,1,1,11]]}
[]
[null,"ALTERNATE or POTENTIAL BOARD MEMBERS",null,null,null,null,null,null,null,null,null,null,"Taken from \"CAPLAW Sample CAA Board Composition Matrix  April 2012\""]
[null,"Name","County ","Cell Phone","Home Phone","Address","Home city/ZIP code","Email","Sector","Level of Interest","Employer","Initial contact ","Skill/Experience/Expertise",null,null,null,null,null,null,null,null,null,null,"Access/Connections"]
[null,null,null,null,null,null,null,null,"Low income (L), Community (C),  or Private (P)","Scale of 1 to 5                                                                           \n  1=No interest             5=Very interested",null,"Date","  P.R. Communications","  Financial Planning/Management","  Organizational Management","  H.R. Management","  Fundraising","  Early childhood education & development","  Attorney",null,null,null,null,"  Foundations","  Wealthy Individuals","  Business/Corporations","  Politics/Government","  Religious Community","  Grassroots Constitutents",null,null,null,null,null,null,null,"L"]
[null,null,null,null,null,null,null,null,null,null,null,null,null,null,null,null,null,null,null,null,null,null,null,null,null,null,null,null,null,null,null,null,null,null,null,null,"C"]
[null,null,null,null,null,null,null,null,null,null,null,null,null,null,null,null,null,null,null,null,null,null,null,null,null,null,null,null,null,null,null,null,null,null,null,null,"P"]
{"$rows_left_out":1}
{"sheet":"Committees","index":6,"n_rows":108,"n_cols":20,"rows_kept":108,"cut":false,"hidden":false,"merged":[[85,6,85,17],[106,6,106,17],[1,6,1,17],[22,6,22,17],[43,6,43,17],[64,6,64,17]]}
[]
[null,1,null,"STANDING COMMITTEE:","(ADD NAME)",null,"Attendance (Enter Date for each Committee Meeting)",null,null,null,null,null,null,null,null,null,null,null,null,"Yes"]
[null,"Committee Members"," Board member? ","Position ","Email Address",null,"Date","Date","Date","Date","Date","Date","Date","Date","Date","Date","Date","Date",null,"No"]
[]
[]
[]
{"$rows_left_out":103}
{"sheet":"Trainings","index":7,"n_rows":9,"n_cols":13,"rows_kept":9,"cut":false,"hidden":false,"merged":[[1,1,1,7]]}
[]
[null,"BOARD ROLES & RESPONSIBILITIES TRAININGS"]
[null,"Training Name","Date of Training ","Topic","Method","Location","Hosted by","Total Attended"]
[]
[null,null,null,null,null,null,null,null,null,null,null,null,"Presenter "]
[null,null,null,null,null,null,null,null,null,null,null,null,"Meeting"]
{"$rows_left_out":4}
{"sheet":"Formulas","index":8,"n_rows":83,"n_cols":17,"rows_kept":83,"cut":false,"hidden":true,"merged":[]}
[null,"L",null,"P",null,"C",null,null,null,null,null,null,null,null,null,null,"Y"]
[{"$f":"IF(B2=\"\",\"\",MAX(A$1:A1)+1)","v":""},{"$f":"IF(Detail!C5=\"Y\",IF(Detail!$E5=B$1,Detail!$B5,\"\"),\"\")","v":""},{"$f":"IF(D2=\"\",\"\",MAX(C$1:C1)+1)","v":""},{"$f":"IF(Detail!C5=\"Y\",IF(Detail!$E5=D$1,Detail!$B5,\"\"),\"\")","v":""},{"$f":"IF(F2=\"\",\"\",MAX(E$1:E1)+1)","v":""},{"$f":"IF(Detail!C5=\"Y\",IF(Detail!$E5=F$1,Detail!$B5,\"\"),\"\")","v":""},null,null,null,null,{"$f":"1","v":1},null,null,null,null,null,"N"]
[{"$f":"IF(B3=\"\",\"\",MAX(A$1:A2)+1)","v":""},{"$f":"IF(Detail!C6=\"Y\",IF(Detail!$E6=B$1,Detail!$B6,\"\"),\"\")","v":""},{"$f":"IF(D3=\"\",\"\",MAX(C$1:C2)+1)","v":""},{"$f":"IF(Detail!C6=\"Y\",IF(Detail!$E6=D$1,Detail!$B6,\"\"),\"\")","v":""},{"$f":"IF(F3=\"\",\"\",MAX(E$1:E2)+1)","v":""},{"$f":"IF(Detail!C6=\"Y\",IF(Detail!$E6=F$1,Detail!$B6,\"\"),\"\")","v":""},null,null,null,null,{"$f":"1+K2","v":2}]
[{"$f":"IF(B4=\"\",\"\",MAX(A$1:A3)+1)","v":""},{"$f":"IF(Detail!C7=\"Y\",IF(Detail!$E7=B$1,Detail!$B7,\"\"),\"\")","v":""},{"$f":"IF(D4=\"\",\"\",MAX(C$1:C3)+1)","v":""},{"$f":"IF(Detail!C7=\"Y\",IF(Detail!$E7=D$1,Detail!$B7,\"\"),\"\")","v":""},{"$f":"IF(F4=\"\",\"\",MAX(E$1:E3)+1)","v":""},{"$f":"IF(Detail!C7=\"Y\",IF(Detail!$E7=F$1,Detail!$B7,\"\"),\"\")","v":""},null,null,null,null,{"$f":"1+K3","v":3}]
[{"$f":"IF(B5=\"\",\"\",MAX(A$1:A4)+1)","v":""},{"$f":"IF(Detail!C8=\"Y\",IF(Detail!$E8=B$1,Detail!$B8,\"\"),\"\")","v":""},{"$f":"IF(D5=\"\",\"\",MAX(C$1:C4)+1)","v":""},{"$f":"IF(Detail!C8=\"Y\",IF(Detail!$E8=D$1,Detail!$B8,\"\"),\"\")","v":""},{"$f":"IF(F5=\"\",\"\",MAX(E$1:E4)+1)","v":""},{"$f":"IF(Detail!C8=\"Y\",IF(Detail!$E8=F$1,Detail!$B8,\"\"),\"\")","v":""},null,null,null,null,4]
[{"$f":"IF(B6=\"\",\"\",MAX(A$1:A5)+1)","v":""},{"$f":"IF(Detail!C9=\"Y\",IF(Detail!$E9=B$1,Detail!$B9,\"\"),\"\")","v":""},{"$f":"IF(D6=\"\",\"\",MAX(C$1:C5)+1)","v":""},{"$f":"IF(Detail!C9=\"Y\",IF(Detail!$E9=D$1,Detail!$B9,\"\"),\"\")","v":""},{"$f":"IF(F6=\"\",\"\",MAX(E$1:E5)+1)","v":""},{"$f":"IF(Detail!C9=\"Y\",IF(Detail!$E9=F$1,Detail!$B9,\"\"),\"\")","v":""},null,null,null,null,5]
{"$rows_left_out":77}