{"text_format":"1","workbook":"xlsx","n_sheets":9,"sheets":["Instructions","Detail","Attendance","Summary","Composition","Alternate or Potential Members","Committees","Trainings","Formulas"],"not_rendered":{"charts":0,"images":1,"macros":1,"external_links":0,"defined_names":9,"comments":0,"pivot_tables":0},"unopened":[],"bounds":{"document_bytes":16777216,"sheet_cells":100000,"rows_first":2000,"rows_last":500,"rows_between":2000,"halvings":0,"cell_chars":16384,"cell_head_chars":4096},"cells_cut":0,"cells_raw":0,"read":"whole","date_system":"1900"}

{"sheet":"Instructions","index":0,"n_rows":16,"n_cols":4,"rows_kept":16,"cut":false,"hidden":false,"merged":[[7,2,7,3],[2,2,2,5],[1,2,1,8],[3,2,3,8],[4,2,4,8],[5,2,5,8]]}
[]
[null,null,"Board Governance Management Tool"]
[]
[null,null,"     The Board Governance Management Tool is designed to aid the agency in overseeing the different aspects associated with community action governing board members. The intent of this multi-use tool is to provide the agency's executive leadership team and the specific board commitee who oversee these responsibilities the ability to effectively manage these aspects within one governance tool."]
[null,null,"     The use of this tool is not mandated, nor does its completion ensure compliance with the Office of Community Services (OCS) Informational memorandum (IM) 138 Organizational Standards or IHCDA's Community Service Block Grant (CSBG) Comprehensive Administrative Review (CAR) Monitoring.  However, it will be a valuable indicator of possible action the agency must take to remain compliant."]
[null,null,"If you have any questions regarding this tool, please email the CSBG monitor."]
[]
[null,null,"Instructions "]
[null,null,"Step 1.","Complete \"Detail\" Sheet\nA. Populate all known information about current Board Members\nB. If cell is RED, must be filled when action completed\nC. If cell is YELLOW, check to see if Board Member's term is up"]
[null,null,"Step 2.","Maintain \"Attendance\" Sheet\nA. Once a Board Meeting has taken place, input the date of the meeting in Row 3 under the column for which month the meeting was held in\nB. Use dropdown list and chart key to log each member's attendance for that month\nC. If you have added a new board member during the year, mark their attendance for prior meeting as \"NS\" or Not Seated"]
[null,null,"Step 3.","Maintain Board Member Information\nA. Add and update any new Board Members during the year\nB. Add and update any new information for current Board Members\nC. Do NOT delete any inactive Board Members (they will be removed the following year)"]
[null,null,"Step 4.","Monitor \"Summary\" and \"Composition\" Sheets\nA. Check \"Summary\" sheet monthly for anything RED that may be out of compliance and resolve if possible\nB. Check \"Composition\" sheet monthly for anything RED that may be out of compliance and resolve if possible"]
[null,null,"Step 5.","Maintain Remaining Sheets\nA.\"Potential Board Members\" - use to accumulate a pool of potential Board Members\nB. \"Committees\" - use to keep track of Committee membership and responsibilities\nC. \"Training\" - use to keep track of Board Member training and attendance numbers"]
[null,null,"Step 6.","Save At End of Year\nA. Create folder for Board Governance Management Tool\nB. Save As \"YYYY Board Governance Management Tool\" to Board Governance Management Tool folder"]
[null,null,"Step 7.","Start New Year\nA. Make copy of previous Board Governance Management Tool and rename with new year\nB. Click \"Reset Attendance\" button\nC. Click \"Remove Inactives\" button"]
[null,null,"Step 8.","Repeat Steps 2-7"]

{"sheet":"Detail","index":1,"n_rows":50,"n_cols":37,"rows_kept":50,"cut":false,"hidden":false,"merged":[[1,17,2,17],[1,20,1,40],[2,20,2,30],[2,31,2,40],[1,18,2,18],[1,19,2,19],[1,1,2,1],[1,4,2,4],[1,6,2,6],[1,11,2,11],[1,16,2,16],[1,13,2,13],[1,14,2,14],[1,15,2,15],[1,2,2,2],[1,3,2,3],[1,7,2,7],[1,8,2,8],[1,10,2,10],[1,12,2,12],[1,5,2,5],[1,9,2,9]]}
[]
[null,"Name","Active?","County ","Sector of Representation","For Use w/ Public Representative Only","Cell Phone","Home Phone ","Address ","City","Zip Code","Email","Does Member Have an Outlook Calendar?","Voted on by Board ","Term End","Signed Orientation Documentation ","Most Recent Bylaws Received ","Most recent Signed Conflict of Interest ","User Defined\n(agency use only)","User Defined\n(agency use only)","Taken from \"CAPLAW Sample CAA Board Composition Matrix  April 2012\""]
[null,null,null,null,null,null,null,null,null,null,null,null,null,null,null,null,null,null,null,null,"Skill/Experience/Expertise",null,null,null,null,null,null,null,null,null,null,"Access/Connections"]
[null,"Add Only Seated Members (No Alternates or Other Designees)","Yes (Y) or No (N) ","Enter County of Residence","Low-income (L)\n\nPublic (P)\n\nCommunity (C) \n(Private)","If Public Representative, Enter Represented Office","Enter Number","Enter Number","Enter Street Address",null,null,"Enter Confirmed Email Address","Yes (Y) or No (N) ","Date","Current Term End Date","Date","Date","Date\n(recommend annually)","User Defined\n(agency use only)","User Defined\n(agency use only)","  P.R. Communications","  Financial Planning/Management","  Organizational Management","  H.R. Management","  Fundraising","  Early childhood education & development","  Attorney",null,null,null,null,"  Foundations","  Wealthy Individuals","  Business/Corporations","  Politics/Government","  Religious Community","  Grassroots Constitutents"]
[]
[]
[]
[]
[]
[]
[]
[]
[]
[]
[]
[]
[]
[]
[]
[]
[]
[]
[]
[]
[]
[]
[]
[]
[]
[]
[]
[]
[]
[]
[]
[]
[]
[]
[]
[]
[]
[]
[]
[]
[]
[]
[]
[null,"L"]
[null,"C"]
[null,"P"]

{"sheet":"Attendance","index":2,"n_rows":58,"n_cols":35,"rows_kept":58,"cut":false,"hidden":false,"merged":[[55,2,55,5],[56,2,56,10],[57,2,57,7],[47,1,47,2],[51,1,51,2],[1,1,42,1],[49,1,49,2],[44,1,44,2],[45,1,45,2],[46,1,46,2]]}
[]
[null,"Board Attendance",null,"Jan","Feb","Mar","Apr","May","Jun","Jul","Aug","Sep","Oct","Nov","Dec","TOTAL MEEETINGS ATTENDED PER PERSON","% ATTENDANCE PER PERSON",null,null,null,null,null,null,"Jan","Feb","Mar","Apr","May","Jun","Jul","Aug","Sep","Oct","Nov","Dec"]
[null,null,"Name","Enter Date","Enter Date","Enter Date","Enter Date","Enter Date","Enter Date","Enter Date","Enter Date","Enter Date","Enter Date","Enter Date","Enter Date",null,null,null,"CHART KEY:",null,null,null,null,"2019-01-01","2019-02-01","2019-03-02","2019-04-03",null,"2019-06-05","2019-07-06","2019-07-23","2019-08-23"]
[null,null,{"$f":"IF(ISBLANK(Detail!B5),\"\",Detail!B5)","v":""},null,null,null,null,null,null,null,null,null,null,null,null,{"$f":"IF(COUNTIFS(D4:O4,\"P\")+COUNTIFS(D4:O4,\"PC\")+COUNTIFS(D4:O4,\"E\")+COUNTIFS(D4:O4,\"X\")+COUNTIFS(D4:O4,\"S\")=0,\"\",COUNTIFS(D4:O4,\"P\")+COUNTIFS(D4:O4,\"PC\")+COUNTIFS(D4:O4,\"S\"))","v":""},{"$f":"IFERROR(IF(P4=\"\",\"\",P4/(SUMPRODUCT(--NOT(ISBLANK(D4:O4)))-COUNTIF(D4:O4,\"NS\"))),\"\")","v":""},null,"P","Present ",null,null,{"$f":"IF(P4=\"\",\"\",P4/(SUMPRODUCT(--NOT(ISBLANK(D4:O4)))-COUNTIF(D4:O4,\"NS\")))","v":""},{"$f":"IF(D4=\"P\",VLOOKUP($C4,Detail!$B$4:$E$44,4,FALSE),IF(D4=\"PC\",VLOOKUP($C4,Detail!$B$4:$E$44,4,FALSE),IF(D4=\"E\",VLOOKUP($C4,Detail!$B$4:$E$44,4,FALSE),IF(D4=\"X\",VLOOKUP($C4,Detail!$B$4:$E$44,4,FALSE),IF(D4=\"S\",VLOOKUP($C4,Detail!$B$4:$E$44,4,FALSE),\"\")))))","v":""},{"$f":"IF(E4=\"P\",VLOOKUP($C4,Detail!$B$4:$E$44,4,FALSE),IF(E4=\"PC\",VLOOKUP($C4,Detail!$B$4:$E$44,4,FALSE),IF(E4=\"E\",VLOOKUP($C4,Detail!$B$4:$E$44,4,FALSE),IF(E4=\"X\",VLOOKUP($C4,Detail!$B$4:$E$44,4,FALSE),IF(E4=\"S\",VLOOKUP($C4,Detail!$B$4:$E$44,4,FALSE),\"\")))))","v":""},{"$f":"IF(F4=\"P\",VLOOKUP($C4,Detail!$B$4:$E$44,4,FALSE),IF(F4=\"PC\",VLOOKUP($C4,Detail!$B$4:$E$44,4,FALSE),IF(F4=\"E\",VLOOKUP($C4,Detail!$B$4:$E$44,4,FALSE),IF(F4=\"X\",VLOOKUP($C4,Detail!$B$4:$E$44,4,FALSE),IF(F4=\"S\",VLOOKUP($C4,Detail!$B$4:$E$44,4,FALSE),\"\")))))","v":""},{"$f":"IF(G4=\"P\",VLOOKUP($C4,Detail!$B$4:$E$44,4,FALSE),IF(G4=\"PC\",VLOOKUP($C4,Detail!$B$4:$E$44,4,FALSE),IF(G4=\"E\",VLOOKUP($C4,Detail!$B$4:$E$44,4,FALSE),IF(G4=\"X\",VLOOKUP($C4,Detail!$B$4:$E$44,4,FALSE),IF(G4=\"S\",VLOOKUP($C4,Detail!$B$4:$E$44,4,FALSE),\"\")))))","v":""},{"$f":"IF(H4=\"P\",VLOOKUP($C4,Detail!$B$4:$E$44,4,FALSE),IF(H4=\"PC\",VLOOKUP($C4,Detail!$B$4:$E$44,4,FALSE),IF(H4=\"E\",VLOOKUP($C4,Detail!$B$4:$E$44,4,FALSE),IF(H4=\"X\",VLOOKUP($C4,Detail!$B$4:$E$44,4,FALSE),IF(H4=\"S\",VLOOKUP($C4,Detail!$B$4:$E$44,4,FALSE),\"\")))))","v":""},{"$f":"IF(I4=\"P\",VLOOKUP($C4,Detail!$B$4:$E$44,4,FALSE),IF(I4=\"PC\",VLOOKUP($C4,Detail!$B$4:$E$44,4,FALSE),IF(I4=\"E\",VLOOKUP($C4,Detail!$B$4:$E$44,4,FALSE),IF(I4=\"X\",VLOOKUP($C4,Detail!$B$4:$E$44,4,FALSE),IF(I4=\"S\",VLOOKUP($C4,Detail!$B$4:$E$44,4,FALSE),\"\")))))","v":""},{"$f":"IF(J4=\"P\",VLOOKUP($C4,Detail!$B$4:$E$44,4,FALSE),IF(J4=\"PC\",VLOOKUP($C4,Detail!$B$4:$E$44,4,FALSE),IF(J4=\"E\",VLOOKUP($C4,Detail!$B$4:$E$44,4,FALSE),IF(J4=\"X\",VLOOKUP($C4,Detail!$B$4:$E$44,4,FALSE),IF(J4=\"S\",VLOOKUP($C4,Detail!$B$4:$E$44,4,FALSE),\"\")))))","v":""},{"$f":"IF(K4=\"P\",VLOOKUP($C4,Detail!$B$4:$E$44,4,FALSE),IF(K4=\"PC\",VLOOKUP($C4,Detail!$B$4:$E$44,4,FALSE),IF(K4=\"E\",VLOOKUP($C4,Detail!$B$4:$E$44,4,FALSE),IF(K4=\"X\",VLOOKUP($C4,Detail!$B$4:$E$44,4,FALSE),IF(K4=\"S\",VLOOKUP($C4,Detail!$B$4:$E$44,4,FALSE),\"\")))))","v":""},{"$f":"IF(L4=\"P\",VLOOKUP($C4,Detail!$B$4:$E$44,4,FALSE),IF(L4=\"PC\",VLOOKUP($C4,Detail!$B$4:$E$44,4,FALSE),IF(L4=\"E\",VLOOKUP($C4,Detail!$B$4:$E$44,4,FALSE),IF(L4=\"X\",VLOOKUP($C4,Detail!$B$4:$E$44,4,FALSE),IF(L4=\"S\",VLOOKUP($C4,Detail!$B$4:$E$44,4,FALSE),\"\")))))","v":""},{"$f":"IF(M4=\"P\",VLOOKUP($C4,Detail!$B$4:$E$44,4,FALSE),IF(M4=\"PC\",VLOOKUP($C4,Detail!$B$4:$E$44,4,FALSE),IF(M4=\"E\",VLOOKUP($C4,Detail!$B$4:$E$44,4,FALSE),IF(M4=\"X\",VLOOKUP($C4,Detail!$B$4:$E$44,4,FALSE),IF(M4=\"S\",VLOOKUP($C4,Detail!$B$4:$E$44,4,FALSE),\"\")))))","v":""},{"$f":"IF(N4=\"P\",VLOOKUP($C4,Detail!$B$4:$E$44,4,FALSE),IF(N4=\"PC\",VLOOKUP($C4,Detail!$B$4:$E$44,4,FALSE),IF(N4=\"E\",VLOOKUP($C4,Detail!$B$4:$E$44,4,FALSE),IF(N4=\"X\",VLOOKUP($C4,Detail!$B$4:$E$44,4,FALSE),IF(N4=\"S\",VLOOKUP($C4,Detail!$B$4:$E$44,4,FALSE),\"\")))))","v":""},{"$f":"IF(O4=\"P\",VLOOKUP($C4,Detail!$B$4:$E$44,4,FALSE),IF(O4=\"PC\",VLOOKUP($C4,Detail!$B$4:$E$44,4,FALSE),IF(O4=\"E\",VLOOKUP($C4,Detail!$B$4:$E$44,4,FALSE),IF(O4=\"X\",VLOOKUP($C4,Detail!$B$4:$E$44,4,FALSE),IF(O4=\"S\",VLOOKUP($C4,Detail!$B$4:$E$44,4,FALSE),\"\")))))","v":""}]
[null,null,{"$f":"IF(ISBLANK(Detail!B6),\"\",Detail!B6)","v":""},null,null,null,null,null,null,null,null,null,null,null,null,{"$f":"IF(COUNTIFS(D5:O5,\"P\")+COUNTIFS(D5:O5,\"PC\")+COUNTIFS(D5:O5,\"E\")+COUNTIFS(D5:O5,\"X\")+COUNTIFS(D5:O5,\"S\")=0,\"\",COUNTIFS(D5:O5,\"P\")+COUNTIFS(D5:O5,\"PC\")+COUNTIFS(D5:O5,\"S\"))","v":""},{"$f":"IFERROR(IF(P5=\"\",\"\",P5/(SUMPRODUCT(--NOT(ISBLANK(D5:O5)))-COUNTIF(D5:O5,\"NS\"))),\"\")","v":""},null,"PC","Present via Call/Videochat",null,null,{"$f":"IF(P5=\"\",\"\",P5/(SUMPRODUCT(--NOT(ISBLANK(D5:O5)))-COUNTIF(D5:O5,\"NS\")))","v":""},{"$f":"IF(D5=\"P\",VLOOKUP($C5,Detail!$B$4:$E$44,4,FALSE),IF(D5=\"PC\",VLOOKUP($C5,Detail!$B$4:$E$44,4,FALSE),IF(D5=\"E\",VLOOKUP($C5,Detail!$B$4:$E$44,4,FALSE),IF(D5=\"X\",VLOOKUP($C5,Detail!$B$4:$E$44,4,FALSE),IF(D5=\"S\",VLOOKUP($C5,Detail!$B$4:$E$44,4,FALSE),\"\")))))","v":""},{"$f":"IF(E5=\"P\",VLOOKUP($C5,Detail!$B$4:$E$44,4,FALSE),IF(E5=\"PC\",VLOOKUP($C5,Detail!$B$4:$E$44,4,FALSE),IF(E5=\"E\",VLOOKUP($C5,Detail!$B$4:$E$44,4,FALSE),IF(E5=\"X\",VLOOKUP($C5,Detail!$B$4:$E$44,4,FALSE),IF(E5=\"S\",VLOOKUP($C5,Detail!$B$4:$E$44,4,FALSE),\"\")))))","v":""},{"$f":"IF(F5=\"P\",VLOOKUP($C5,Detail!$B$4:$E$44,4,FALSE),IF(F5=\"PC\",VLOOKUP($C5,Detail!$B$4:$E$44,4,FALSE),IF(F5=\"E\",VLOOKUP($C5,Detail!$B$4:$E$44,4,FALSE),IF(F5=\"X\",VLOOKUP($C5,Detail!$B$4:$E$44,4,FALSE),IF(F5=\"S\",VLOOKUP($C5,Detail!$B$4:$E$44,4,FALSE),\"\")))))","v":""},{"$f":"IF(G5=\"P\",VLOOKUP($C5,Detail!$B$4:$E$44,4,FALSE),IF(G5=\"PC\",VLOOKUP($C5,Detail!$B$4:$E$44,4,FALSE),IF(G5=\"E\",VLOOKUP($C5,Detail!$B$4:$E$44,4,FALSE),IF(G5=\"X\",VLOOKUP($C5,Detail!$B$4:$E$44,4,FALSE),IF(G5=\"S\",VLOOKUP($C5,Detail!$B$4:$E$44,4,FALSE),\"\")))))","v":""},{"$f":"IF(H5=\"P\",VLOOKUP($C5,Detail!$B$4:$E$44,4,FALSE),IF(H5=\"PC\",VLOOKUP($C5,Detail!$B$4:$E$44,4,FALSE),IF(H5=\"E\",VLOOKUP($C5,Detail!$B$4:$E$44,4,FALSE),IF(H5=\"X\",VLOOKUP($C5,Detail!$B$4:$E$44,4,FALSE),IF(H5=\"S\",VLOOKUP($C5,Detail!$B$4:$E$44,4,FALSE),\"\")))))","v":""},{"$f":"IF(I5=\"P\",VLOOKUP($C5,Detail!$B$4:$E$44,4,FALSE),IF(I5=\"PC\",VLOOKUP($C5,Detail!$B$4:$E$44,4,FALSE),IF(I5=\"E\",VLOOKUP($C5,Detail!$B$4:$E$44,4,FALSE),IF(I5=\"X\",VLOOKUP($C5,Detail!$B$4:$E$44,4,FALSE),IF(I5=\"S\",VLOOKUP($C5,Detail!$B$4:$E$44,4,FALSE),\"\")))))","v":""},{"$f":"IF(J5=\"P\",VLOOKUP($C5,Detail!$B$4:$E$44,4,FALSE),IF(J5=\"PC\",VLOOKUP($C5,Detail!$B$4:$E$44,4,FALSE),IF(J5=\"E\",VLOOKUP($C5,Detail!$B$4:$E$44,4,FALSE),IF(J5=\"X\",VLOOKUP($C5,Detail!$B$4:$E$44,4,FALSE),IF(J5=\"S\",VLOOKUP($C5,Detail!$B$4:$E$44,4,FALSE),\"\")))))","v":""},{"$f":"IF(K5=\"P\",VLOOKUP($C5,Detail!$B$4:$E$44,4,FALSE),IF(K5=\"PC\",VLOOKUP($C5,Detail!$B$4:$E$44,4,FALSE),IF(K5=\"E\",VLOOKUP($C5,Detail!$B$4:$E$44,4,FALSE),IF(K5=\"X\",VLOOKUP($C5,Detail!$B$4:$E$44,4,FALSE),IF(K5=\"S\",VLOOKUP($C5,Detail!$B$4:$E$44,4,FALSE),\"\")))))","v":""},{"$f":"IF(L5=\"P\",VLOOKUP($C5,Detail!$B$4:$E$44,4,FALSE),IF(L5=\"PC\",VLOOKUP($C5,Detail!$B$4:$E$44,4,FALSE),IF(L5=\"E\",VLOOKUP($C5,Detail!$B$4:$E$44,4,FALSE),IF(L5=\"X\",VLOOKUP($C5,Detail!$B$4:$E$44,4,FALSE),IF(L5=\"S\",VLOOKUP($C5,Detail!$B$4:$E$44,4,FALSE),\"\")))))","v":""},{"$f":"IF(M5=\"P\",VLOOKUP($C5,Detail!$B$4:$E$44,4,FALSE),IF(M5=\"PC\",VLOOKUP($C5,Detail!$B$4:$E$44,4,FALSE),IF(M5=\"E\",VLOOKUP($C5,Detail!$B$4:$E$44,4,FALSE),IF(M5=\"X\",VLOOKUP($C5,Detail!$B$4:$E$44,4,FALSE),IF(M5=\"S\",VLOOKUP($C5,Detail!$B$4:$E$44,4,FALSE),\"\")))))","v":""},{"$f":"IF(N5=\"P\",VLOOKUP($C5,Detail!$B$4:$E$44,4,FALSE),IF(N5=\"PC\",VLOOKUP($C5,Detail!$B$4:$E$44,4,FALSE),IF(N5=\"E\",VLOOKUP($C5,Detail!$B$4:$E$44,4,FALSE),IF(N5=\"X\",VLOOKUP($C5,Detail!$B$4:$E$44,4,FALSE),IF(N5=\"S\",VLOOKUP($C5,Detail!$B$4:$E$44,4,FALSE),\"\")))))","v":""},{"$f":"IF(O5=\"P\",VLOOKUP($C5,Detail!$B$4:$E$44,4,FALSE),IF(O5=\"PC\",VLOOKUP($C5,Detail!$B$4:$E$44,4,FALSE),IF(O5=\"E\",VLOOKUP($C5,Detail!$B$4:$E$44,4,FALSE),IF(O5=\"X\",VLOOKUP($C5,Detail!$B$4:$E$44,4,FALSE),IF(O5=\"S\",VLOOKUP($C5,Detail!$B$4:$E$44,4,FALSE),\"\")))))","v":""}]
[null,null,{"$f":"IF(ISBLANK(Detail!B7),\"\",Detail!B7)","v":""},null,null,null,null,null,null,null,null,null,null,null,null,"","",null,"E","Excused",null,null,"",{"$f":"IF(D6=\"P\",VLOOKUP($C6,Detail!$B$4:$E$44,4,FALSE),IF(D6=\"PC\",VLOOKUP($C6,Detail!$B$4:$E$44,4,FALSE),IF(D6=\"E\",VLOOKUP($C6,Detail!$B$4:$E$44,4,FALSE),IF(D6=\"X\",VLOOKUP($C6,Detail!$B$4:$E$44,4,FALSE),IF(D6=\"S\",VLOOKUP($C6,Detail!$B$4:$E$44,4,FALSE),\"\")))))","v":""},{"$f":"IF(E6=\"P\",VLOOKUP($C6,Detail!$B$4:$E$44,4,FALSE),IF(E6=\"PC\",VLOOKUP($C6,Detail!$B$4:$E$44,4,FALSE),IF(E6=\"E\",VLOOKUP($C6,Detail!$B$4:$E$44,4,FALSE),IF(E6=\"X\",VLOOKUP($C6,Detail!$B$4:$E$44,4,FALSE),IF(E6=\"S\",VLOOKUP($C6,Detail!$B$4:$E$44,4,FALSE),\"\")))))","v":""},{"$f":"IF(F6=\"P\",VLOOKUP($C6,Detail!$B$4:$E$44,4,FALSE),IF(F6=\"PC\",VLOOKUP($C6,Detail!$B$4:$E$44,4,FALSE),IF(F6=\"E\",VLOOKUP($C6,Detail!$B$4:$E$44,4,FALSE),IF(F6=\"X\",VLOOKUP($C6,Detail!$B$4:$E$44,4,FALSE),IF(F6=\"S\",VLOOKUP($C6,Detail!$B$4:$E$44,4,FALSE),\"\")))))","v":""},{"$f":"IF(G6=\"P\",VLOOKUP($C6,Detail!$B$4:$E$44,4,FALSE),IF(G6=\"PC\",VLOOKUP($C6,Detail!$B$4:$E$44,4,FALSE),IF(G6=\"E\",VLOOKUP($C6,Detail!$B$4:$E$44,4,FALSE),IF(G6=\"X\",VLOOKUP($C6,Detail!$B$4:$E$44,4,FALSE),IF(G6=\"S\",VLOOKUP($C6,Detail!$B$4:$E$44,4,FALSE),\"\")))))","v":""},{"$f":"IF(H6=\"P\",VLOOKUP($C6,Detail!$B$4:$E$44,4,FALSE),IF(H6=\"PC\",VLOOKUP($C6,Detail!$B$4:$E$44,4,FALSE),IF(H6=\"E\",VLOOKUP($C6,Detail!$B$4:$E$44,4,FALSE),IF(H6=\"X\",VLOOKUP($C6,Detail!$B$4:$E$44,4,FALSE),IF(H6=\"S\",VLOOKUP($C6,Detail!$B$4:$E$44,4,FALSE),\"\")))))","v":""},{"$f":"IF(I6=\"P\",VLOOKUP($C6,Detail!$B$4:$E$44,4,FALSE),IF(I6=\"PC\",VLOOKUP($C6,Detail!$B$4:$E$44,4,FALSE),IF(I6=\"E\",VLOOKUP($C6,Detail!$B$4:$E$44,4,FALSE),IF(I6=\"X\",VLOOKUP($C6,Detail!$B$4:$E$44,4,FALSE),IF(I6=\"S\",VLOOKUP($C6,Detail!$B$4:$E$44,4,FALSE),\"\")))))","v":""},{"$f":"IF(J6=\"P\",VLOOKUP($C6,Detail!$B$4:$E$44,4,FALSE),IF(J6=\"PC\",VLOOKUP($C6,Detail!$B$4:$E$44,4,FALSE),IF(J6=\"E\",VLOOKUP($C6,Detail!$B$4:$E$44,4,FALSE),IF(J6=\"X\",VLOOKUP($C6,Detail!$B$4:$E$44,4,FALSE),IF(J6=\"S\",VLOOKUP($C6,Detail!$B$4:$E$44,4,FALSE),\"\")))))","v":""},{"$f":"IF(K6=\"P\",VLOOKUP($C6,Detail!$B$4:$E$44,4,FALSE),IF(K6=\"PC\",VLOOKUP($C6,Detail!$B$4:$E$44,4,FALSE),IF(K6=\"E\",VLOOKUP($C6,Detail!$B$4:$E$44,4,FALSE),IF(K6=\"X\",VLOOKUP($C6,Detail!$B$4:$E$44,4,FALSE),IF(K6=\"S\",VLOOKUP($C6,Detail!$B$4:$E$44,4,FALSE),\"\")))))","v":""},{"$f":"IF(L6=\"P\",VLOOKUP($C6,Detail!$B$4:$E$44,4,FALSE),IF(L6=\"PC\",VLOOKUP($C6,Detail!$B$4:$E$44,4,FALSE),IF(L6=\"E\",VLOOKUP($C6,Detail!$B$4:$E$44,4,FALSE),IF(L6=\"X\",VLOOKUP($C6,Detail!$B$4:$E$44,4,FALSE),IF(L6=\"S\",VLOOKUP($C6,Detail!$B$4:$E$44,4,FALSE),\"\")))))","v":""},{"$f":"IF(M6=\"P\",VLOOKUP($C6,Detail!$B$4:$E$44,4,FALSE),IF(M6=\"PC\",VLOOKUP($C6,Detail!$B$4:$E$44,4,FALSE),IF(M6=\"E\",VLOOKUP($C6,Detail!$B$4:$E$44,4,FALSE),IF(M6=\"X\",VLOOKUP($C6,Detail!$B$4:$E$44,4,FALSE),IF(M6=\"S\",VLOOKUP($C6,Detail!$B$4:$E$44,4,FALSE),\"\")))))","v":""},{"$f":"IF(N6=\"P\",VLOOKUP($C6,Detail!$B$4:$E$44,4,FALSE),IF(N6=\"PC\",VLOOKUP($C6,Detail!$B$4:$E$44,4,FALSE),IF(N6=\"E\",VLOOKUP($C6,Detail!$B$4:$E$44,4,FALSE),IF(N6=\"X\",VLOOKUP($C6,Detail!$B$4:$E$44,4,FALSE),IF(N6=\"S\",VLOOKUP($C6,Detail!$B$4:$E$44,4,FALSE),\"\")))))","v":""},{"$f":"IF(O6=\"P\",VLOOKUP($C6,Detail!$B$4:$E$44,4,FALSE),IF(O6=\"PC\",VLOOKUP($C6,Detail!$B$4:$E$44,4,FALSE),IF(O6=\"E\",VLOOKUP($C6,Detail!$B$4:$E$44,4,FALSE),IF(O6=\"X\",VLOOKUP($C6,Detail!$B$4:$E$44,4,FALSE),IF(O6=\"S\",VLOOKUP($C6,Detail!$B$4:$E$44,4,FALSE),\"\")))))","v":""}]
[null,null,{"$f":"IF(ISBLANK(Detail!B8),\"\",Detail!B8)","v":""},null,null,null,null,null,null,null,null,null,null,null,null,"","",null,"X","Unexcused",null,null,"",{"$f":"IF(D7=\"P\",VLOOKUP($C7,Detail!$B$4:$E$44,4,FALSE),IF(D7=\"PC\",VLOOKUP($C7,Detail!$B$4:$E$44,4,FALSE),IF(D7=\"E\",VLOOKUP($C7,Detail!$B$4:$E$44,4,FALSE),IF(D7=\"X\",VLOOKUP($C7,Detail!$B$4:$E$44,4,FALSE),IF(D7=\"S\",VLOOKUP($C7,Detail!$B$4:$E$44,4,FALSE),\"\")))))","v":""},{"$f":"IF(E7=\"P\",VLOOKUP($C7,Detail!$B$4:$E$44,4,FALSE),IF(E7=\"PC\",VLOOKUP($C7,Detail!$B$4:$E$44,4,FALSE),IF(E7=\"E\",VLOOKUP($C7,Detail!$B$4:$E$44,4,FALSE),IF(E7=\"X\",VLOOKUP($C7,Detail!$B$4:$E$44,4,FALSE),IF(E7=\"S\",VLOOKUP($C7,Detail!$B$4:$E$44,4,FALSE),\"\")))))","v":""},{"$f":"IF(F7=\"P\",VLOOKUP($C7,Detail!$B$4:$E$44,4,FALSE),IF(F7=\"PC\",VLOOKUP($C7,Detail!$B$4:$E$44,4,FALSE),IF(F7=\"E\",VLOOKUP($C7,Detail!$B$4:$E$44,4,FALSE),IF(F7=\"X\",VLOOKUP($C7,Detail!$B$4:$E$44,4,FALSE),IF(F7=\"S\",VLOOKUP($C7,Detail!$B$4:$E$44,4,FALSE),\"\")))))","v":""},{"$f":"IF(G7=\"P\",VLOOKUP($C7,Detail!$B$4:$E$44,4,FALSE),IF(G7=\"PC\",VLOOKUP($C7,Detail!$B$4:$E$44,4,FALSE),IF(G7=\"E\",VLOOKUP($C7,Detail!$B$4:$E$44,4,FALSE),IF(G7=\"X\",VLOOKUP($C7,Detail!$B$4:$E$44,4,FALSE),IF(G7=\"S\",VLOOKUP($C7,Detail!$B$4:$E$44,4,FALSE),\"\")))))","v":""},{"$f":"IF(H7=\"P\",VLOOKUP($C7,Detail!$B$4:$E$44,4,FALSE),IF(H7=\"PC\",VLOOKUP($C7,Detail!$B$4:$E$44,4,FALSE),IF(H7=\"E\",VLOOKUP($C7,Detail!$B$4:$E$44,4,FALSE),IF(H7=\"X\",VLOOKUP($C7,Detail!$B$4:$E$44,4,FALSE),IF(H7=\"S\",VLOOKUP($C7,Detail!$B$4:$E$44,4,FALSE),\"\")))))","v":""},{"$f":"IF(I7=\"P\",VLOOKUP($C7,Detail!$B$4:$E$44,4,FALSE),IF(I7=\"PC\",VLOOKUP($C7,Detail!$B$4:$E$44,4,FALSE),IF(I7=\"E\",VLOOKUP($C7,Detail!$B$4:$E$44,4,FALSE),IF(I7=\"X\",VLOOKUP($C7,Detail!$B$4:$E$44,4,FALSE),IF(I7=\"S\",VLOOKUP($C7,Detail!$B$4:$E$44,4,FALSE),\"\")))))","v":""},{"$f":"IF(J7=\"P\",VLOOKUP($C7,Detail!$B$4:$E$44,4,FALSE),IF(J7=\"PC\",VLOOKUP($C7,Detail!$B$4:$E$44,4,FALSE),IF(J7=\"E\",VLOOKUP($C7,Detail!$B$4:$E$44,4,FALSE),IF(J7=\"X\",VLOOKUP($C7,Detail!$B$4:$E$44,4,FALSE),IF(J7=\"S\",VLOOKUP($C7,Detail!$B$4:$E$44,4,FALSE),\"\")))))","v":""},{"$f":"IF(K7=\"P\",VLOOKUP($C7,Detail!$B$4:$E$44,4,FALSE),IF(K7=\"PC\",VLOOKUP($C7,Detail!$B$4:$E$44,4,FALSE),IF(K7=\"E\",VLOOKUP($C7,Detail!$B$4:$E$44,4,FALSE),IF(K7=\"X\",VLOOKUP($C7,Detail!$B$4:$E$44,4,FALSE),IF(K7=\"S\",VLOOKUP($C7,Detail!$B$4:$E$44,4,FALSE),\"\")))))","v":""},{"$f":"IF(L7=\"P\",VLOOKUP($C7,Detail!$B$4:$E$44,4,FALSE),IF(L7=\"PC\",VLOOKUP($C7,Detail!$B$4:$E$44,4,FALSE),IF(L7=\"E\",VLOOKUP($C7,Detail!$B$4:$E$44,4,FALSE),IF(L7=\"X\",VLOOKUP($C7,Detail!$B$4:$E$44,4,FALSE),IF(L7=\"S\",VLOOKUP($C7,Detail!$B$4:$E$44,4,FALSE),\"\")))))","v":""},{"$f":"IF(M7=\"P\",VLOOKUP($C7,Detail!$B$4:$E$44,4,FALSE),IF(M7=\"PC\",VLOOKUP($C7,Detail!$B$4:$E$44,4,FALSE),IF(M7=\"E\",VLOOKUP($C7,Detail!$B$4:$E$44,4,FALSE),IF(M7=\"X\",VLOOKUP($C7,Detail!$B$4:$E$44,4,FALSE),IF(M7=\"S\",VLOOKUP($C7,Detail!$B$4:$E$44,4,FALSE),\"\")))))","v":""},{"$f":"IF(N7=\"P\",VLOOKUP($C7,Detail!$B$4:$E$44,4,FALSE),IF(N7=\"PC\",VLOOKUP($C7,Detail!$B$4:$E$44,4,FALSE),IF(N7=\"E\",VLOOKUP($C7,Detail!$B$4:$E$44,4,FALSE),IF(N7=\"X\",VLOOKUP($C7,Detail!$B$4:$E$44,4,FALSE),IF(N7=\"S\",VLOOKUP($C7,Detail!$B$4:$E$44,4,FALSE),\"\")))))","v":""},{"$f":"IF(O7=\"P\",VLOOKUP($C7,Detail!$B$4:$E$44,4,FALSE),IF(O7=\"PC\",VLOOKUP($C7,Detail!$B$4:$E$44,4,FALSE),IF(O7=\"E\",VLOOKUP($C7,Detail!$B$4:$E$44,4,FALSE),IF(O7=\"X\",VLOOKUP($C7,Detail!$B$4:$E$44,4,FALSE),IF(O7=\"S\",VLOOKUP($C7,Detail!$B$4:$E$44,4,FALSE),\"\")))))","v":""}]
[null,null,{"$f":"IF(ISBLANK(Detail!B9),\"\",Detail!B9)","v":""},null,null,null,null,null,null,null,null,null,null,null,null,"","",null,"NS","Not Seated (yet or any longer)",null,null,"",{"$f":"IF(D8=\"P\",VLOOKUP($C8,Detail!$B$4:$E$44,4,FALSE),IF(D8=\"PC\",VLOOKUP($C8,Detail!$B$4:$E$44,4,FALSE),IF(D8=\"E\",VLOOKUP($C8,Detail!$B$4:$E$44,4,FALSE),IF(D8=\"X\",VLOOKUP($C8,Detail!$B$4:$E$44,4,FALSE),IF(D8=\"S\",VLOOKUP($C8,Detail!$B$4:$E$44,4,FALSE),\"\")))))","v":""},{"$f":"IF(E8=\"P\",VLOOKUP($C8,Detail!$B$4:$E$44,4,FALSE),IF(E8=\"PC\",VLOOKUP($C8,Detail!$B$4:$E$44,4,FALSE),IF(E8=\"E\",VLOOKUP($C8,Detail!$B$4:$E$44,4,FALSE),IF(E8=\"X\",VLOOKUP($C8,Detail!$B$4:$E$44,4,FALSE),IF(E8=\"S\",VLOOKUP($C8,Detail!$B$4:$E$44,4,FALSE),\"\")))))","v":""},{"$f":"IF(F8=\"P\",VLOOKUP($C8,Detail!$B$4:$E$44,4,FALSE),IF(F8=\"PC\",VLOOKUP($C8,Detail!$B$4:$E$44,4,FALSE),IF(F8=\"E\",VLOOKUP($C8,Detail!$B$4:$E$44,4,FALSE),IF(F8=\"X\",VLOOKUP($C8,Detail!$B$4:$E$44,4,FALSE),IF(F8=\"S\",VLOOKUP($C8,Detail!$B$4:$E$44,4,FALSE),\"\")))))","v":""},{"$f":"IF(G8=\"P\",VLOOKUP($C8,Detail!$B$4:$E$44,4,FALSE),IF(G8=\"PC\",VLOOKUP($C8,Detail!$B$4:$E$44,4,FALSE),IF(G8=\"E\",VLOOKUP($C8,Detail!$B$4:$E$44,4,FALSE),IF(G8=\"X\",VLOOKUP($C8,Detail!$B$4:$E$44,4,FALSE),IF(G8=\"S\",VLOOKUP($C8,Detail!$B$4:$E$44,4,FALSE),\"\")))))","v":""},{"$f":"IF(H8=\"P\",VLOOKUP($C8,Detail!$B$4:$E$44,4,FALSE),IF(H8=\"PC\",VLOOKUP($C8,Detail!$B$4:$E$44,4,FALSE),IF(H8=\"E\",VLOOKUP($C8,Detail!$B$4:$E$44,4,FALSE),IF(H8=\"X\",VLOOKUP($C8,Detail!$B$4:$E$44,4,FALSE),IF(H8=\"S\",VLOOKUP($C8,Detail!$B$4:$E$44,4,FALSE),\"\")))))","v":""},{"$f":"IF(I8=\"P\",VLOOKUP($C8,Detail!$B$4:$E$44,4,FALSE),IF(I8=\"PC\",VLOOKUP($C8,Detail!$B$4:$E$44,4,FALSE),IF(I8=\"E\",VLOOKUP($C8,Detail!$B$4:$E$44,4,FALSE),IF(I8=\"X\",VLOOKUP($C8,Detail!$B$4:$E$44,4,FALSE),IF(I8=\"S\",VLOOKUP($C8,Detail!$B$4:$E$44,4,FALSE),\"\")))))","v":""},{"$f":"IF(J8=\"P\",VLOOKUP($C8,Detail!$B$4:$E$44,4,FALSE),IF(J8=\"PC\",VLOOKUP($C8,Detail!$B$4:$E$44,4,FALSE),IF(J8=\"E\",VLOOKUP($C8,Detail!$B$4:$E$44,4,FALSE),IF(J8=\"X\",VLOOKUP($C8,Detail!$B$4:$E$44,4,FALSE),IF(J8=\"S\",VLOOKUP($C8,Detail!$B$4:$E$44,4,FALSE),\"\")))))","v":""},{"$f":"IF(K8=\"P\",VLOOKUP($C8,Detail!$B$4:$E$44,4,FALSE),IF(K8=\"PC\",VLOOKUP($C8,Detail!$B$4:$E$44,4,FALSE),IF(K8=\"E\",VLOOKUP($C8,Detail!$B$4:$E$44,4,FALSE),IF(K8=\"X\",VLOOKUP($C8,Detail!$B$4:$E$44,4,FALSE),IF(K8=\"S\",VLOOKUP($C8,Detail!$B$4:$E$44,4,FALSE),\"\")))))","v":""},{"$f":"IF(L8=\"P\",VLOOKUP($C8,Detail!$B$4:$E$44,4,FALSE),IF(L8=\"PC\",VLOOKUP($C8,Detail!$B$4:$E$44,4,FALSE),IF(L8=\"E\",VLOOKUP($C8,Detail!$B$4:$E$44,4,FALSE),IF(L8=\"X\",VLOOKUP($C8,Detail!$B$4:$E$44,4,FALSE),IF(L8=\"S\",VLOOKUP($C8,Detail!$B$4:$E$44,4,FALSE),\"\")))))","v":""},{"$f":"IF(M8=\"P\",VLOOKUP($C8,Detail!$B$4:$E$44,4,FALSE),IF(M8=\"PC\",VLOOKUP($C8,Detail!$B$4:$E$44,4,FALSE),IF(M8=\"E\",VLOOKUP($C8,Detail!$B$4:$E$44,4,FALSE),IF(M8=\"X\",VLOOKUP($C8,Detail!$B$4:$E$44,4,FALSE),IF(M8=\"S\",VLOOKUP($C8,Detail!$B$4:$E$44,4,FALSE),\"\")))))","v":""},{"$f":"IF(N8=\"P\",VLOOKUP($C8,Detail!$B$4:$E$44,4,FALSE),IF(N8=\"PC\",VLOOKUP($C8,Detail!$B$4:$E$44,4,FALSE),IF(N8=\"E\",VLOOKUP($C8,Detail!$B$4:$E$44,4,FALSE),IF(N8=\"X\",VLOOKUP($C8,Detail!$B$4:$E$44,4,FALSE),IF(N8=\"S\",VLOOKUP($C8,Detail!$B$4:$E$44,4,FALSE),\"\")))))","v":""},{"$f":"IF(O8=\"P\",VLOOKUP($C8,Detail!$B$4:$E$44,4,FALSE),IF(O8=\"PC\",VLOOKUP($C8,Detail!$B$4:$E$44,4,FALSE),IF(O8=\"E\",VLOOKUP($C8,Detail!$B$4:$E$44,4,FALSE),IF(O8=\"X\",VLOOKUP($C8,Detail!$B$4:$E$44,4,FALSE),IF(O8=\"S\",VLOOKUP($C8,Detail!$B$4:$E$44,4,FALSE),\"\")))))","v":""}]
[null,null,{"$f":"IF(ISBLANK(Detail!B10),\"\",Detail!B10)","v":""},null,null,null,null,null,null,null,null,null,null,null,null,"","",null,"S","Seated (new member 1st meeting)",null,null,"",{"$f":"IF(D9=\"P\",VLOOKUP($C9,Detail!$B$4:$E$44,4,FALSE),IF(D9=\"PC\",VLOOKUP($C9,Detail!$B$4:$E$44,4,FALSE),IF(D9=\"E\",VLOOKUP($C9,Detail!$B$4:$E$44,4,FALSE),IF(D9=\"X\",VLOOKUP($C9,Detail!$B$4:$E$44,4,FALSE),IF(D9=\"S\",VLOOKUP($C9,Detail!$B$4:$E$44,4,FALSE),\"\")))))","v":""},{"$f":"IF(E9=\"P\",VLOOKUP($C9,Detail!$B$4:$E$44,4,FALSE),IF(E9=\"PC\",VLOOKUP($C9,Detail!$B$4:$E$44,4,FALSE),IF(E9=\"E\",VLOOKUP($C9,Detail!$B$4:$E$44,4,FALSE),IF(E9=\"X\",VLOOKUP($C9,Detail!$B$4:$E$44,4,FALSE),IF(E9=\"S\",VLOOKUP($C9,Detail!$B$4:$E$44,4,FALSE),\"\")))))","v":""},{"$f":"IF(F9=\"P\",VLOOKUP($C9,Detail!$B$4:$E$44,4,FALSE),IF(F9=\"PC\",VLOOKUP($C9,Detail!$B$4:$E$44,4,FALSE),IF(F9=\"E\",VLOOKUP($C9,Detail!$B$4:$E$44,4,FALSE),IF(F9=\"X\",VLOOKUP($C9,Detail!$B$4:$E$44,4,FALSE),IF(F9=\"S\",VLOOKUP($C9,Detail!$B$4:$E$44,4,FALSE),\"\")))))","v":""},{"$f":"IF(G9=\"P\",VLOOKUP($C9,Detail!$B$4:$E$44,4,FALSE),IF(G9=\"PC\",VLOOKUP($C9,Detail!$B$4:$E$44,4,FALSE),IF(G9=\"E\",VLOOKUP($C9,Detail!$B$4:$E$44,4,FALSE),IF(G9=\"X\",VLOOKUP($C9,Detail!$B$4:$E$44,4,FALSE),IF(G9=\"S\",VLOOKUP($C9,Detail!$B$4:$E$44,4,FALSE),\"\")))))","v":""},{"$f":"IF(H9=\"P\",VLOOKUP($C9,Detail!$B$4:$E$44,4,FALSE),IF(H9=\"PC\",VLOOKUP($C9,Detail!$B$4:$E$44,4,FALSE),IF(H9=\"E\",VLOOKUP($C9,Detail!$B$4:$E$44,4,FALSE),IF(H9=\"X\",VLOOKUP($C9,Detail!$B$4:$E$44,4,FALSE),IF(H9=\"S\",VLOOKUP($C9,Detail!$B$4:$E$44,4,FALSE),\"\")))))","v":""},{"$f":"IF(I9=\"P\",VLOOKUP($C9,Detail!$B$4:$E$44,4,FALSE),IF(I9=\"PC\",VLOOKUP($C9,Detail!$B$4:$E$44,4,FALSE),IF(I9=\"E\",VLOOKUP($C9,Detail!$B$4:$E$44,4,FALSE),IF(I9=\"X\",VLOOKUP($C9,Detail!$B$4:$E$44,4,FALSE),IF(I9=\"S\",VLOOKUP($C9,Detail!$B$4:$E$44,4,FALSE),\"\")))))","v":""},{"$f":"IF(J9=\"P\",VLOOKUP($C9,Detail!$B$4:$E$44,4,FALSE),IF(J9=\"PC\",VLOOKUP($C9,Detail!$B$4:$E$44,4,FALSE),IF(J9=\"E\",VLOOKUP($C9,Detail!$B$4:$E$44,4,FALSE),IF(J9=\"X\",VLOOKUP($C9,Detail!$B$4:$E$44,4,FALSE),IF(J9=\"S\",VLOOKUP($C9,Detail!$B$4:$E$44,4,FALSE),\"\")))))","v":""},{"$f":"IF(K9=\"P\",VLOOKUP($C9,Detail!$B$4:$E$44,4,FALSE),IF(K9=\"PC\",VLOOKUP($C9,Detail!$B$4:$E$44,4,FALSE),IF(K9=\"E\",VLOOKUP($C9,Detail!$B$4:$E$44,4,FALSE),IF(K9=\"X\",VLOOKUP($C9,Detail!$B$4:$E$44,4,FALSE),IF(K9=\"S\",VLOOKUP($C9,Detail!$B$4:$E$44,4,FALSE),\"\")))))","v":""},{"$f":"IF(L9=\"P\",VLOOKUP($C9,Detail!$B$4:$E$44,4,FALSE),IF(L9=\"PC\",VLOOKUP($C9,Detail!$B$4:$E$44,4,FALSE),IF(L9=\"E\",VLOOKUP($C9,Detail!$B$4:$E$44,4,FALSE),IF(L9=\"X\",VLOOKUP($C9,Detail!$B$4:$E$44,4,FALSE),IF(L9=\"S\",VLOOKUP($C9,Detail!$B$4:$E$44,4,FALSE),\"\")))))","v":""},{"$f":"IF(M9=\"P\",VLOOKUP($C9,Detail!$B$4:$E$44,4,FALSE),IF(M9=\"PC\",VLOOKUP($C9,Detail!$B$4:$E$44,4,FALSE),IF(M9=\"E\",VLOOKUP($C9,Detail!$B$4:$E$44,4,FALSE),IF(M9=\"X\",VLOOKUP($C9,Detail!$B$4:$E$44,4,FALSE),IF(M9=\"S\",VLOOKUP($C9,Detail!$B$4:$E$44,4,FALSE),\"\")))))","v":""},{"$f":"IF(N9=\"P\",VLOOKUP($C9,Detail!$B$4:$E$44,4,FALSE),IF(N9=\"PC\",VLOOKUP($C9,Detail!$B$4:$E$44,4,FALSE),IF(N9=\"E\",VLOOKUP($C9,Detail!$B$4:$E$44,4,FALSE),IF(N9=\"X\",VLOOKUP($C9,Detail!$B$4:$E$44,4,FALSE),IF(N9=\"S\",VLOOKUP($C9,Detail!$B$4:$E$44,4,FALSE),\"\")))))","v":""},{"$f":"IF(O9=\"P\",VLOOKUP($C9,Detail!$B$4:$E$44,4,FALSE),IF(O9=\"PC\",VLOOKUP($C9,Detail!$B$4:$E$44,4,FALSE),IF(O9=\"E\",VLOOKUP($C9,Detail!$B$4:$E$44,4,FALSE),IF(O9=\"X\",VLOOKUP($C9,Detail!$B$4:$E$44,4,FALSE),IF(O9=\"S\",VLOOKUP($C9,Detail!$B$4:$E$44,4,FALSE),\"\")))))","v":""}]
[null,null,{"$f":"IF(ISBLANK(Detail!B11),\"\",Detail!B11)","v":""},null,null,null,null,null,null,null,null,null,null,null,null,"","",null,null,"No meeting",null,null,"",{"$f":"IF(D10=\"P\",VLOOKUP($C10,Detail!$B$4:$E$44,4,FALSE),IF(D10=\"PC\",VLOOKUP($C10,Detail!$B$4:$E$44,4,FALSE),IF(D10=\"E\",VLOOKUP($C10,Detail!$B$4:$E$44,4,FALSE),IF(D10=\"X\",VLOOKUP($C10,Detail!$B$4:$E$44,4,FALSE),IF(D10=\"S\",VLOOKUP($C10,Detail!$B$4:$E$44,4,FALSE),\"\")))))","v":""},{"$f":"IF(E10=\"P\",VLOOKUP($C10,Detail!$B$4:$E$44,4,FALSE),IF(E10=\"PC\",VLOOKUP($C10,Detail!$B$4:$E$44,4,FALSE),IF(E10=\"E\",VLOOKUP($C10,Detail!$B$4:$E$44,4,FALSE),IF(E10=\"X\",VLOOKUP($C10,Detail!$B$4:$E$44,4,FALSE),IF(E10=\"S\",VLOOKUP($C10,Detail!$B$4:$E$44,4,FALSE),\"\")))))","v":""},{"$f":"IF(F10=\"P\",VLOOKUP($C10,Detail!$B$4:$E$44,4,FALSE),IF(F10=\"PC\",VLOOKUP($C10,Detail!$B$4:$E$44,4,FALSE),IF(F10=\"E\",VLOOKUP($C10,Detail!$B$4:$E$44,4,FALSE),IF(F10=\"X\",VLOOKUP($C10,Detail!$B$4:$E$44,4,FALSE),IF(F10=\"S\",VLOOKUP($C10,Detail!$B$4:$E$44,4,FALSE),\"\")))))","v":""},{"$f":"IF(G10=\"P\",VLOOKUP($C10,Detail!$B$4:$E$44,4,FALSE),IF(G10=\"PC\",VLOOKUP($C10,Detail!$B$4:$E$44,4,FALSE),IF(G10=\"E\",VLOOKUP($C10,Detail!$B$4:$E$44,4,FALSE),IF(G10=\"X\",VLOOKUP($C10,Detail!$B$4:$E$44,4,FALSE),IF(G10=\"S\",VLOOKUP($C10,Detail!$B$4:$E$44,4,FALSE),\"\")))))","v":""},{"$f":"IF(H10=\"P\",VLOOKUP($C10,Detail!$B$4:$E$44,4,FALSE),IF(H10=\"PC\",VLOOKUP($C10,Detail!$B$4:$E$44,4,FALSE),IF(H10=\"E\",VLOOKUP($C10,Detail!$B$4:$E$44,4,FALSE),IF(H10=\"X\",VLOOKUP($C10,Detail!$B$4:$E$44,4,FALSE),IF(H10=\"S\",VLOOKUP($C10,Detail!$B$4:$E$44,4,FALSE),\"\")))))","v":""},{"$f":"IF(I10=\"P\",VLOOKUP($C10,Detail!$B$4:$E$44,4,FALSE),IF(I10=\"PC\",VLOOKUP($C10,Detail!$B$4:$E$44,4,FALSE),IF(I10=\"E\",VLOOKUP($C10,Detail!$B$4:$E$44,4,FALSE),IF(I10=\"X\",VLOOKUP($C10,Detail!$B$4:$E$44,4,FALSE),IF(I10=\"S\",VLOOKUP($C10,Detail!$B$4:$E$44,4,FALSE),\"\")))))","v":""},{"$f":"IF(J10=\"P\",VLOOKUP($C10,Detail!$B$4:$E$44,4,FALSE),IF(J10=\"PC\",VLOOKUP($C10,Detail!$B$4:$E$44,4,FALSE),IF(J10=\"E\",VLOOKUP($C10,Detail!$B$4:$E$44,4,FALSE),IF(J10=\"X\",VLOOKUP($C10,Detail!$B$4:$E$44,4,FALSE),IF(J10=\"S\",VLOOKUP($C10,Detail!$B$4:$E$44,4,FALSE),\"\")))))","v":""},{"$f":"IF(K10=\"P\",VLOOKUP($C10,Detail!$B$4:$E$44,4,FALSE),IF(K10=\"PC\",VLOOKUP($C10,Detail!$B$4:$E$44,4,FALSE),IF(K10=\"E\",VLOOKUP($C10,Detail!$B$4:$E$44,4,FALSE),IF(K10=\"X\",VLOOKUP($C10,Detail!$B$4:$E$44,4,FALSE),IF(K10=\"S\",VLOOKUP($C10,Detail!$B$4:$E$44,4,FALSE),\"\")))))","v":""},{"$f":"IF(L10=\"P\",VLOOKUP($C10,Detail!$B$4:$E$44,4,FALSE),IF(L10=\"PC\",VLOOKUP($C10,Detail!$B$4:$E$44,4,FALSE),IF(L10=\"E\",VLOOKUP($C10,Detail!$B$4:$E$44,4,FALSE),IF(L10=\"X\",VLOOKUP($C10,Detail!$B$4:$E$44,4,FALSE),IF(L10=\"S\",VLOOKUP($C10,Detail!$B$4:$E$44,4,FALSE),\"\")))))","v":""},{"$f":"IF(M10=\"P\",VLOOKUP($C10,Detail!$B$4:$E$44,4,FALSE),IF(M10=\"PC\",VLOOKUP($C10,Detail!$B$4:$E$44,4,FALSE),IF(M10=\"E\",VLOOKUP($C10,Detail!$B$4:$E$44,4,FALSE),IF(M10=\"X\",VLOOKUP($C10,Detail!$B$4:$E$44,4,FALSE),IF(M10=\"S\",VLOOKUP($C10,Detail!$B$4:$E$44,4,FALSE),\"\")))))","v":""},{"$f":"IF(N10=\"P\",VLOOKUP($C10,Detail!$B$4:$E$44,4,FALSE),IF(N10=\"PC\",VLOOKUP($C10,Detail!$B$4:$E$44,4,FALSE),IF(N10=\"E\",VLOOKUP($C10,Detail!$B$4:$E$44,4,FALSE),IF(N10=\"X\",VLOOKUP($C10,Detail!$B$4:$E$44,4,FALSE),IF(N10=\"S\",VLOOKUP($C10,Detail!$B$4:$E$44,4,FALSE),\"\")))))","v":""},{"$f":"IF(O10=\"P\",VLOOKUP($C10,Detail!$B$4:$E$44,4,FALSE),IF(O10=\"PC\",VLOOKUP($C10,Detail!$B$4:$E$44,4,FALSE),IF(O10=\"E\",VLOOKUP($C10,Detail!$B$4:$E$44,4,FALSE),IF(O10=\"X\",VLOOKUP($C10,Detail!$B$4:$E$44,4,FALSE),IF(O10=\"S\",VLOOKUP($C10,Detail!$B$4:$E$44,4,FALSE),\"\")))))","v":""}]
[null,null,{"$f":"IF(ISBLANK(Detail!B12),\"\",Detail!B12)","v":""},null,null,null,null,null,null,null,null,null,null,null,null,"","",null,null,null,null,null,"",{"$f":"IF(D11=\"P\",VLOOKUP($C11,Detail!$B$4:$E$44,4,FALSE),IF(D11=\"PC\",VLOOKUP($C11,Detail!$B$4:$E$44,4,FALSE),IF(D11=\"E\",VLOOKUP($C11,Detail!$B$4:$E$44,4,FALSE),IF(D11=\"X\",VLOOKUP($C11,Detail!$B$4:$E$44,4,FALSE),IF(D11=\"S\",VLOOKUP($C11,Detail!$B$4:$E$44,4,FALSE),\"\")))))","v":""},{"$f":"IF(E11=\"P\",VLOOKUP($C11,Detail!$B$4:$E$44,4,FALSE),IF(E11=\"PC\",VLOOKUP($C11,Detail!$B$4:$E$44,4,FALSE),IF(E11=\"E\",VLOOKUP($C11,Detail!$B$4:$E$44,4,FALSE),IF(E11=\"X\",VLOOKUP($C11,Detail!$B$4:$E$44,4,FALSE),IF(E11=\"S\",VLOOKUP($C11,Detail!$B$4:$E$44,4,FALSE),\"\")))))","v":""},{"$f":"IF(F11=\"P\",VLOOKUP($C11,Detail!$B$4:$E$44,4,FALSE),IF(F11=\"PC\",VLOOKUP($C11,Detail!$B$4:$E$44,4,FALSE),IF(F11=\"E\",VLOOKUP($C11,Detail!$B$4:$E$44,4,FALSE),IF(F11=\"X\",VLOOKUP($C11,Detail!$B$4:$E$44,4,FALSE),IF(F11=\"S\",VLOOKUP($C11,Detail!$B$4:$E$44,4,FALSE),\"\")))))","v":""},{"$f":"IF(G11=\"P\",VLOOKUP($C11,Detail!$B$4:$E$44,4,FALSE),IF(G11=\"PC\",VLOOKUP($C11,Detail!$B$4:$E$44,4,FALSE),IF(G11=\"E\",VLOOKUP($C11,Detail!$B$4:$E$44,4,FALSE),IF(G11=\"X\",VLOOKUP($C11,Detail!$B$4:$E$44,4,FALSE),IF(G11=\"S\",VLOOKUP($C11,Detail!$B$4:$E$44,4,FALSE),\"\")))))","v":""},{"$f":"IF(H11=\"P\",VLOOKUP($C11,Detail!$B$4:$E$44,4,FALSE),IF(H11=\"PC\",VLOOKUP($C11,Detail!$B$4:$E$44,4,FALSE),IF(H11=\"E\",VLOOKUP($C11,Detail!$B$4:$E$44,4,FALSE),IF(H11=\"X\",VLOOKUP($C11,Detail!$B$4:$E$44,4,FALSE),IF(H11=\"S\",VLOOKUP($C11,Detail!$B$4:$E$44,4,FALSE),\"\")))))","v":""},{"$f":"IF(I11=\"P\",VLOOKUP($C11,Detail!$B$4:$E$44,4,FALSE),IF(I11=\"PC\",VLOOKUP($C11,Detail!$B$4:$E$44,4,FALSE),IF(I11=\"E\",VLOOKUP($C11,Detail!$B$4:$E$44,4,FALSE),IF(I11=\"X\",VLOOKUP($C11,Detail!$B$4:$E$44,4,FALSE),IF(I11=\"S\",VLOOKUP($C11,Detail!$B$4:$E$44,4,FALSE),\"\")))))","v":""},{"$f":"IF(J11=\"P\",VLOOKUP($C11,Detail!$B$4:$E$44,4,FALSE),IF(J11=\"PC\",VLOOKUP($C11,Detail!$B$4:$E$44,4,FALSE),IF(J11=\"E\",VLOOKUP($C11,Detail!$B$4:$E$44,4,FALSE),IF(J11=\"X\",VLOOKUP($C11,Detail!$B$4:$E$44,4,FALSE),IF(J11=\"S\",VLOOKUP($C11,Detail!$B$4:$E$44,4,FALSE),\"\")))))","v":""},{"$f":"IF(K11=\"P\",VLOOKUP($C11,Detail!$B$4:$E$44,4,FALSE),IF(K11=\"PC\",VLOOKUP($C11,Detail!$B$4:$E$44,4,FALSE),IF(K11=\"E\",VLOOKUP($C11,Detail!$B$4:$E$44,4,FALSE),IF(K11=\"X\",VLOOKUP($C11,Detail!$B$4:$E$44,4,FALSE),IF(K11=\"S\",VLOOKUP($C11,Detail!$B$4:$E$44,4,FALSE),\"\")))))","v":""},{"$f":"IF(L11=\"P\",VLOOKUP($C11,Detail!$B$4:$E$44,4,FALSE),IF(L11=\"PC\",VLOOKUP($C11,Detail!$B$4:$E$44,4,FALSE),IF(L11=\"E\",VLOOKUP($C11,Detail!$B$4:$E$44,4,FALSE),IF(L11=\"X\",VLOOKUP($C11,Detail!$B$4:$E$44,4,FALSE),IF(L11=\"S\",VLOOKUP($C11,Detail!$B$4:$E$44,4,FALSE),\"\")))))","v":""},{"$f":"IF(M11=\"P\",VLOOKUP($C11,Detail!$B$4:$E$44,4,FALSE),IF(M11=\"PC\",VLOOKUP($C11,Detail!$B$4:$E$44,4,FALSE),IF(M11=\"E\",VLOOKUP($C11,Detail!$B$4:$E$44,4,FALSE),IF(M11=\"X\",VLOOKUP($C11,Detail!$B$4:$E$44,4,FALSE),IF(M11=\"S\",VLOOKUP($C11,Detail!$B$4:$E$44,4,FALSE),\"\")))))","v":""},{"$f":"IF(N11=\"P\",VLOOKUP($C11,Detail!$B$4:$E$44,4,FALSE),IF(N11=\"PC\",VLOOKUP($C11,Detail!$B$4:$E$44,4,FALSE),IF(N11=\"E\",VLOOKUP($C11,Detail!$B$4:$E$44,4,FALSE),IF(N11=\"X\",VLOOKUP($C11,Detail!$B$4:$E$44,4,FALSE),IF(N11=\"S\",VLOOKUP($C11,Detail!$B$4:$E$44,4,FALSE),\"\")))))","v":""},{"$f":"IF(O11=\"P\",VLOOKUP($C11,Detail!$B$4:$E$44,4,FALSE),IF(O11=\"PC\",VLOOKUP($C11,Detail!$B$4:$E$44,4,FALSE),IF(O11=\"E\",VLOOKUP($C11,Detail!$B$4:$E$44,4,FALSE),IF(O11=\"X\",VLOOKUP($C11,Detail!$B$4:$E$44,4,FALSE),IF(O11=\"S\",VLOOKUP($C11,Detail!$B$4:$E$44,4,FALSE),\"\")))))","v":""}]
[null,null,{"$f":"IF(ISBLANK(Detail!B13),\"\",Detail!B13)","v":""},null,null,null,null,null,null,null,null,null,null,null,null,"","",null,null,null,null,null,"",{"$f":"IF(D12=\"P\",VLOOKUP($C12,Detail!$B$4:$E$44,4,FALSE),IF(D12=\"PC\",VLOOKUP($C12,Detail!$B$4:$E$44,4,FALSE),IF(D12=\"E\",VLOOKUP($C12,Detail!$B$4:$E$44,4,FALSE),IF(D12=\"X\",VLOOKUP($C12,Detail!$B$4:$E$44,4,FALSE),IF(D12=\"S\",VLOOKUP($C12,Detail!$B$4:$E$44,4,FALSE),\"\")))))","v":""},{"$f":"IF(E12=\"P\",VLOOKUP($C12,Detail!$B$4:$E$44,4,FALSE),IF(E12=\"PC\",VLOOKUP($C12,Detail!$B$4:$E$44,4,FALSE),IF(E12=\"E\",VLOOKUP($C12,Detail!$B$4:$E$44,4,FALSE),IF(E12=\"X\",VLOOKUP($C12,Detail!$B$4:$E$44,4,FALSE),IF(E12=\"S\",VLOOKUP($C12,Detail!$B$4:$E$44,4,FALSE),\"\")))))","v":""},{"$f":"IF(F12=\"P\",VLOOKUP($C12,Detail!$B$4:$E$44,4,FALSE),IF(F12=\"PC\",VLOOKUP($C12,Detail!$B$4:$E$44,4,FALSE),IF(F12=\"E\",VLOOKUP($C12,Detail!$B$4:$E$44,4,FALSE),IF(F12=\"X\",VLOOKUP($C12,Detail!$B$4:$E$44,4,FALSE),IF(F12=\"S\",VLOOKUP($C12,Detail!$B$4:$E$44,4,FALSE),\"\")))))","v":""},{"$f":"IF(G12=\"P\",VLOOKUP($C12,Detail!$B$4:$E$44,4,FALSE),IF(G12=\"PC\",VLOOKUP($C12,Detail!$B$4:$E$44,4,FALSE),IF(G12=\"E\",VLOOKUP($C12,Detail!$B$4:$E$44,4,FALSE),IF(G12=\"X\",VLOOKUP($C12,Detail!$B$4:$E$44,4,FALSE),IF(G12=\"S\",VLOOKUP($C12,Detail!$B$4:$E$44,4,FALSE),\"\")))))","v":""},{"$f":"IF(H12=\"P\",VLOOKUP($C12,Detail!$B$4:$E$44,4,FALSE),IF(H12=\"PC\",VLOOKUP($C12,Detail!$B$4:$E$44,4,FALSE),IF(H12=\"E\",VLOOKUP($C12,Detail!$B$4:$E$44,4,FALSE),IF(H12=\"X\",VLOOKUP($C12,Detail!$B$4:$E$44,4,FALSE),IF(H12=\"S\",VLOOKUP($C12,Detail!$B$4:$E$44,4,FALSE),\"\")))))","v":""},{"$f":"IF(I12=\"P\",VLOOKUP($C12,Detail!$B$4:$E$44,4,FALSE),IF(I12=\"PC\",VLOOKUP($C12,Detail!$B$4:$E$44,4,FALSE),IF(I12=\"E\",VLOOKUP($C12,Detail!$B$4:$E$44,4,FALSE),IF(I12=\"X\",VLOOKUP($C12,Detail!$B$4:$E$44,4,FALSE),IF(I12=\"S\",VLOOKUP($C12,Detail!$B$4:$E$44,4,FALSE),\"\")))))","v":""},{"$f":"IF(J12=\"P\",VLOOKUP($C12,Detail!$B$4:$E$44,4,FALSE),IF(J12=\"PC\",VLOOKUP($C12,Detail!$B$4:$E$44,4,FALSE),IF(J12=\"E\",VLOOKUP($C12,Detail!$B$4:$E$44,4,FALSE),IF(J12=\"X\",VLOOKUP($C12,Detail!$B$4:$E$44,4,FALSE),IF(J12=\"S\",VLOOKUP($C12,Detail!$B$4:$E$44,4,FALSE),\"\")))))","v":""},{"$f":"IF(K12=\"P\",VLOOKUP($C12,Detail!$B$4:$E$44,4,FALSE),IF(K12=\"PC\",VLOOKUP($C12,Detail!$B$4:$E$44,4,FALSE),IF(K12=\"E\",VLOOKUP($C12,Detail!$B$4:$E$44,4,FALSE),IF(K12=\"X\",VLOOKUP($C12,Detail!$B$4:$E$44,4,FALSE),IF(K12=\"S\",VLOOKUP($C12,Detail!$B$4:$E$44,4,FALSE),\"\")))))","v":""},{"$f":"IF(L12=\"P\",VLOOKUP($C12,Detail!$B$4:$E$44,4,FALSE),IF(L12=\"PC\",VLOOKUP($C12,Detail!$B$4:$E$44,4,FALSE),IF(L12=\"E\",VLOOKUP($C12,Detail!$B$4:$E$44,4,FALSE),IF(L12=\"X\",VLOOKUP($C12,Detail!$B$4:$E$44,4,FALSE),IF(L12=\"S\",VLOOKUP($C12,Detail!$B$4:$E$44,4,FALSE),\"\")))))","v":""},{"$f":"IF(M12=\"P\",VLOOKUP($C12,Detail!$B$4:$E$44,4,FALSE),IF(M12=\"PC\",VLOOKUP($C12,Detail!$B$4:$E$44,4,FALSE),IF(M12=\"E\",VLOOKUP($C12,Detail!$B$4:$E$44,4,FALSE),IF(M12=\"X\",VLOOKUP($C12,Detail!$B$4:$E$44,4,FALSE),IF(M12=\"S\",VLOOKUP($C12,Detail!$B$4:$E$44,4,FALSE),\"\")))))","v":""},{"$f":"IF(N12=\"P\",VLOOKUP($C12,Detail!$B$4:$E$44,4,FALSE),IF(N12=\"PC\",VLOOKUP($C12,Detail!$B$4:$E$44,4,FALSE),IF(N12=\"E\",VLOOKUP($C12,Detail!$B$4:$E$44,4,FALSE),IF(N12=\"X\",VLOOKUP($C12,Detail!$B$4:$E$44,4,FALSE),IF(N12=\"S\",VLOOKUP($C12,Detail!$B$4:$E$44,4,FALSE),\"\")))))","v":""},{"$f":"IF(O12=\"P\",VLOOKUP($C12,Detail!$B$4:$E$44,4,FALSE),IF(O12=\"PC\",VLOOKUP($C12,Detail!$B$4:$E$44,4,FALSE),IF(O12=\"E\",VLOOKUP($C12,Detail!$B$4:$E$44,4,FALSE),IF(O12=\"X\",VLOOKUP($C12,Detail!$B$4:$E$44,4,FALSE),IF(O12=\"S\",VLOOKUP($C12,Detail!$B$4:$E$44,4,FALSE),\"\")))))","v":""}]
[null,null,{"$f":"IF(ISBLANK(Detail!B14),\"\",Detail!B14)","v":""},null,null,null,null,null,null,null,null,null,null,null,null,"","",null,null,null,null,null,"",{"$f":"IF(D13=\"P\",VLOOKUP($C13,Detail!$B$4:$E$44,4,FALSE),IF(D13=\"PC\",VLOOKUP($C13,Detail!$B$4:$E$44,4,FALSE),IF(D13=\"E\",VLOOKUP($C13,Detail!$B$4:$E$44,4,FALSE),IF(D13=\"X\",VLOOKUP($C13,Detail!$B$4:$E$44,4,FALSE),IF(D13=\"S\",VLOOKUP($C13,Detail!$B$4:$E$44,4,FALSE),\"\")))))","v":""},{"$f":"IF(E13=\"P\",VLOOKUP($C13,Detail!$B$4:$E$44,4,FALSE),IF(E13=\"PC\",VLOOKUP($C13,Detail!$B$4:$E$44,4,FALSE),IF(E13=\"E\",VLOOKUP($C13,Detail!$B$4:$E$44,4,FALSE),IF(E13=\"X\",VLOOKUP($C13,Detail!$B$4:$E$44,4,FALSE),IF(E13=\"S\",VLOOKUP($C13,Detail!$B$4:$E$44,4,FALSE),\"\")))))","v":""},{"$f":"IF(F13=\"P\",VLOOKUP($C13,Detail!$B$4:$E$44,4,FALSE),IF(F13=\"PC\",VLOOKUP($C13,Detail!$B$4:$E$44,4,FALSE),IF(F13=\"E\",VLOOKUP($C13,Detail!$B$4:$E$44,4,FALSE),IF(F13=\"X\",VLOOKUP($C13,Detail!$B$4:$E$44,4,FALSE),IF(F13=\"S\",VLOOKUP($C13,Detail!$B$4:$E$44,4,FALSE),\"\")))))","v":""},{"$f":"IF(G13=\"P\",VLOOKUP($C13,Detail!$B$4:$E$44,4,FALSE),IF(G13=\"PC\",VLOOKUP($C13,Detail!$B$4:$E$44,4,FALSE),IF(G13=\"E\",VLOOKUP($C13,Detail!$B$4:$E$44,4,FALSE),IF(G13=\"X\",VLOOKUP($C13,Detail!$B$4:$E$44,4,FALSE),IF(G13=\"S\",VLOOKUP($C13,Detail!$B$4:$E$44,4,FALSE),\"\")))))","v":""},{"$f":"IF(H13=\"P\",VLOOKUP($C13,Detail!$B$4:$E$44,4,FALSE),IF(H13=\"PC\",VLOOKUP($C13,Detail!$B$4:$E$44,4,FALSE),IF(H13=\"E\",VLOOKUP($C13,Detail!$B$4:$E$44,4,FALSE),IF(H13=\"X\",VLOOKUP($C13,Detail!$B$4:$E$44,4,FALSE),IF(H13=\"S\",VLOOKUP($C13,Detail!$B$4:$E$44,4,FALSE),\"\")))))","v":""},{"$f":"IF(I13=\"P\",VLOOKUP($C13,Detail!$B$4:$E$44,4,FALSE),IF(I13=\"PC\",VLOOKUP($C13,Detail!$B$4:$E$44,4,FALSE),IF(I13=\"E\",VLOOKUP($C13,Detail!$B$4:$E$44,4,FALSE),IF(I13=\"X\",VLOOKUP($C13,Detail!$B$4:$E$44,4,FALSE),IF(I13=\"S\",VLOOKUP($C13,Detail!$B$4:$E$44,4,FALSE),\"\")))))","v":""},{"$f":"IF(J13=\"P\",VLOOKUP($C13,Detail!$B$4:$E$44,4,FALSE),IF(J13=\"PC\",VLOOKUP($C13,Detail!$B$4:$E$44,4,FALSE),IF(J13=\"E\",VLOOKUP($C13,Detail!$B$4:$E$44,4,FALSE),IF(J13=\"X\",VLOOKUP($C13,Detail!$B$4:$E$44,4,FALSE),IF(J13=\"S\",VLOOKUP($C13,Detail!$B$4:$E$44,4,FALSE),\"\")))))","v":""},{"$f":"IF(K13=\"P\",VLOOKUP($C13,Detail!$B$4:$E$44,4,FALSE),IF(K13=\"PC\",VLOOKUP($C13,Detail!$B$4:$E$44,4,FALSE),IF(K13=\"E\",VLOOKUP($C13,Detail!$B$4:$E$44,4,FALSE),IF(K13=\"X\",VLOOKUP($C13,Detail!$B$4:$E$44,4,FALSE),IF(K13=\"S\",VLOOKUP($C13,Detail!$B$4:$E$44,4,FALSE),\"\")))))","v":""},{"$f":"IF(L13=\"P\",VLOOKUP($C13,Detail!$B$4:$E$44,4,FALSE),IF(L13=\"PC\",VLOOKUP($C13,Detail!$B$4:$E$44,4,FALSE),IF(L13=\"E\",VLOOKUP($C13,Detail!$B$4:$E$44,4,FALSE),IF(L13=\"X\",VLOOKUP($C13,Detail!$B$4:$E$44,4,FALSE),IF(L13=\"S\",VLOOKUP($C13,Detail!$B$4:$E$44,4,FALSE),\"\")))))","v":""},{"$f":"IF(M13=\"P\",VLOOKUP($C13,Detail!$B$4:$E$44,4,FALSE),IF(M13=\"PC\",VLOOKUP($C13,Detail!$B$4:$E$44,4,FALSE),IF(M13=\"E\",VLOOKUP($C13,Detail!$B$4:$E$44,4,FALSE),IF(M13=\"X\",VLOOKUP($C13,Detail!$B$4:$E$44,4,FALSE),IF(M13=\"S\",VLOOKUP($C13,Detail!$B$4:$E$44,4,FALSE),\"\")))))","v":""},{"$f":"IF(N13=\"P\",VLOOKUP($C13,Detail!$B$4:$E$44,4,FALSE),IF(N13=\"PC\",VLOOKUP($C13,Detail!$B$4:$E$44,4,FALSE),IF(N13=\"E\",VLOOKUP($C13,Detail!$B$4:$E$44,4,FALSE),IF(N13=\"X\",VLOOKUP($C13,Detail!$B$4:$E$44,4,FALSE),IF(N13=\"S\",VLOOKUP($C13,Detail!$B$4:$E$44,4,FALSE),\"\")))))","v":""},{"$f":"IF(O13=\"P\",VLOOKUP($C13,Detail!$B$4:$E$44,4,FALSE),IF(O13=\"PC\",VLOOKUP($C13,Detail!$B$4:$E$44,4,FALSE),IF(O13=\"E\",VLOOKUP($C13,Detail!$B$4:$E$44,4,FALSE),IF(O13=\"X\",VLOOKUP($C13,Detail!$B$4:$E$44,4,FALSE),IF(O13=\"S\",VLOOKUP($C13,Detail!$B$4:$E$44,4,FALSE),\"\")))))","v":""}]
[null,null,{"$f":"IF(ISBLANK(Detail!B15),\"\",Detail!B15)","v":""},null,null,null,null,null,null,null,null,null,null,null,null,"","",null,null,null,null,null,"",{"$f":"IF(D14=\"P\",VLOOKUP($C14,Detail!$B$4:$E$44,4,FALSE),IF(D14=\"PC\",VLOOKUP($C14,Detail!$B$4:$E$44,4,FALSE),IF(D14=\"E\",VLOOKUP($C14,Detail!$B$4:$E$44,4,FALSE),IF(D14=\"X\",VLOOKUP($C14,Detail!$B$4:$E$44,4,FALSE),IF(D14=\"S\",VLOOKUP($C14,Detail!$B$4:$E$44,4,FALSE),\"\")))))","v":""},{"$f":"IF(E14=\"P\",VLOOKUP($C14,Detail!$B$4:$E$44,4,FALSE),IF(E14=\"PC\",VLOOKUP($C14,Detail!$B$4:$E$44,4,FALSE),IF(E14=\"E\",VLOOKUP($C14,Detail!$B$4:$E$44,4,FALSE),IF(E14=\"X\",VLOOKUP($C14,Detail!$B$4:$E$44,4,FALSE),IF(E14=\"S\",VLOOKUP($C14,Detail!$B$4:$E$44,4,FALSE),\"\")))))","v":""},{"$f":"IF(F14=\"P\",VLOOKUP($C14,Detail!$B$4:$E$44,4,FALSE),IF(F14=\"PC\",VLOOKUP($C14,Detail!$B$4:$E$44,4,FALSE),IF(F14=\"E\",VLOOKUP($C14,Detail!$B$4:$E$44,4,FALSE),IF(F14=\"X\",VLOOKUP($C14,Detail!$B$4:$E$44,4,FALSE),IF(F14=\"S\",VLOOKUP($C14,Detail!$B$4:$E$44,4,FALSE),\"\")))))","v":""},{"$f":"IF(G14=\"P\",VLOOKUP($C14,Detail!$B$4:$E$44,4,FALSE),IF(G14=\"PC\",VLOOKUP($C14,Detail!$B$4:$E$44,4,FALSE),IF(G14=\"E\",VLOOKUP($C14,Detail!$B$4:$E$44,4,FALSE),IF(G14=\"X\",VLOOKUP($C14,Detail!$B$4:$E$44,4,FALSE),IF(G14=\"S\",VLOOKUP($C14,Detail!$B$4:$E$44,4,FALSE),\"\")))))","v":""},{"$f":"IF(H14=\"P\",VLOOKUP($C14,Detail!$B$4:$E$44,4,FALSE),IF(H14=\"PC\",VLOOKUP($C14,Detail!$B$4:$E$44,4,FALSE),IF(H14=\"E\",VLOOKUP($C14,Detail!$B$4:$E$44,4,FALSE),IF(H14=\"X\",VLOOKUP($C14,Detail!$B$4:$E$44,4,FALSE),IF(H14=\"S\",VLOOKUP($C14,Detail!$B$4:$E$44,4,FALSE),\"\")))))","v":""},{"$f":"IF(I14=\"P\",VLOOKUP($C14,Detail!$B$4:$E$44,4,FALSE),IF(I14=\"PC\",VLOOKUP($C14,Detail!$B$4:$E$44,4,FALSE),IF(I14=\"E\",VLOOKUP($C14,Detail!$B$4:$E$44,4,FALSE),IF(I14=\"X\",VLOOKUP($C14,Detail!$B$4:$E$44,4,FALSE),IF(I14=\"S\",VLOOKUP($C14,Detail!$B$4:$E$44,4,FALSE),\"\")))))","v":""},{"$f":"IF(J14=\"P\",VLOOKUP($C14,Detail!$B$4:$E$44,4,FALSE),IF(J14=\"PC\",VLOOKUP($C14,Detail!$B$4:$E$44,4,FALSE),IF(J14=\"E\",VLOOKUP($C14,Detail!$B$4:$E$44,4,FALSE),IF(J14=\"X\",VLOOKUP($C14,Detail!$B$4:$E$44,4,FALSE),IF(J14=\"S\",VLOOKUP($C14,Detail!$B$4:$E$44,4,FALSE),\"\")))))","v":""},{"$f":"IF(K14=\"P\",VLOOKUP($C14,Detail!$B$4:$E$44,4,FALSE),IF(K14=\"PC\",VLOOKUP($C14,Detail!$B$4:$E$44,4,FALSE),IF(K14=\"E\",VLOOKUP($C14,Detail!$B$4:$E$44,4,FALSE),IF(K14=\"X\",VLOOKUP($C14,Detail!$B$4:$E$44,4,FALSE),IF(K14=\"S\",VLOOKUP($C14,Detail!$B$4:$E$44,4,FALSE),\"\")))))","v":""},{"$f":"IF(L14=\"P\",VLOOKUP($C14,Detail!$B$4:$E$44,4,FALSE),IF(L14=\"PC\",VLOOKUP($C14,Detail!$B$4:$E$44,4,FALSE),IF(L14=\"E\",VLOOKUP($C14,Detail!$B$4:$E$44,4,FALSE),IF(L14=\"X\",VLOOKUP($C14,Detail!$B$4:$E$44,4,FALSE),IF(L14=\"S\",VLOOKUP($C14,Detail!$B$4:$E$44,4,FALSE),\"\")))))","v":""},{"$f":"IF(M14=\"P\",VLOOKUP($C14,Detail!$B$4:$E$44,4,FALSE),IF(M14=\"PC\",VLOOKUP($C14,Detail!$B$4:$E$44,4,FALSE),IF(M14=\"E\",VLOOKUP($C14,Detail!$B$4:$E$44,4,FALSE),IF(M14=\"X\",VLOOKUP($C14,Detail!$B$4:$E$44,4,FALSE),IF(M14=\"S\",VLOOKUP($C14,Detail!$B$4:$E$44,4,FALSE),\"\")))))","v":""},{"$f":"IF(N14=\"P\",VLOOKUP($C14,Detail!$B$4:$E$44,4,FALSE),IF(N14=\"PC\",VLOOKUP($C14,Detail!$B$4:$E$44,4,FALSE),IF(N14=\"E\",VLOOKUP($C14,Detail!$B$4:$E$44,4,FALSE),IF(N14=\"X\",VLOOKUP($C14,Detail!$B$4:$E$44,4,FALSE),IF(N14=\"S\",VLOOKUP($C14,Detail!$B$4:$E$44,4,FALSE),\"\")))))","v":""},{"$f":"IF(O14=\"P\",VLOOKUP($C14,Detail!$B$4:$E$44,4,FALSE),IF(O14=\"PC\",VLOOKUP($C14,Detail!$B$4:$E$44,4,FALSE),IF(O14=\"E\",VLOOKUP($C14,Detail!$B$4:$E$44,4,FALSE),IF(O14=\"X\",VLOOKUP($C14,Detail!$B$4:$E$44,4,FALSE),IF(O14=\"S\",VLOOKUP($C14,Detail!$B$4:$E$44,4,FALSE),\"\")))))","v":""}]
[null,null,{"$f":"IF(ISBLANK(Detail!B16),\"\",Detail!B16)","v":""},null,null,null,null,null,null,null,null,null,null,null,null,"","",null,null,null,null,null,"",{"$f":"IF(D15=\"P\",VLOOKUP($C15,Detail!$B$4:$E$44,4,FALSE),IF(D15=\"PC\",VLOOKUP($C15,Detail!$B$4:$E$44,4,FALSE),IF(D15=\"E\",VLOOKUP($C15,Detail!$B$4:$E$44,4,FALSE),IF(D15=\"X\",VLOOKUP($C15,Detail!$B$4:$E$44,4,FALSE),IF(D15=\"S\",VLOOKUP($C15,Detail!$B$4:$E$44,4,FALSE),\"\")))))","v":""},{"$f":"IF(E15=\"P\",VLOOKUP($C15,Detail!$B$4:$E$44,4,FALSE),IF(E15=\"PC\",VLOOKUP($C15,Detail!$B$4:$E$44,4,FALSE),IF(E15=\"E\",VLOOKUP($C15,Detail!$B$4:$E$44,4,FALSE),IF(E15=\"X\",VLOOKUP($C15,Detail!$B$4:$E$44,4,FALSE),IF(E15=\"S\",VLOOKUP($C15,Detail!$B$4:$E$44,4,FALSE),\"\")))))","v":""},{"$f":"IF(F15=\"P\",VLOOKUP($C15,Detail!$B$4:$E$44,4,FALSE),IF(F15=\"PC\",VLOOKUP($C15,Detail!$B$4:$E$44,4,FALSE),IF(F15=\"E\",VLOOKUP($C15,Detail!$B$4:$E$44,4,FALSE),IF(F15=\"X\",VLOOKUP($C15,Detail!$B$4:$E$44,4,FALSE),IF(F15=\"S\",VLOOKUP($C15,Detail!$B$4:$E$44,4,FALSE),\"\")))))","v":""},{"$f":"IF(G15=\"P\",VLOOKUP($C15,Detail!$B$4:$E$44,4,FALSE),IF(G15=\"PC\",VLOOKUP($C15,Detail!$B$4:$E$44,4,FALSE),IF(G15=\"E\",VLOOKUP($C15,Detail!$B$4:$E$44,4,FALSE),IF(G15=\"X\",VLOOKUP($C15,Detail!$B$4:$E$44,4,FALSE),IF(G15=\"S\",VLOOKUP($C15,Detail!$B$4:$E$44,4,FALSE),\"\")))))","v":""},{"$f":"IF(H15=\"P\",VLOOKUP($C15,Detail!$B$4:$E$44,4,FALSE),IF(H15=\"PC\",VLOOKUP($C15,Detail!$B$4:$E$44,4,FALSE),IF(H15=\"E\",VLOOKUP($C15,Detail!$B$4:$E$44,4,FALSE),IF(H15=\"X\",VLOOKUP($C15,Detail!$B$4:$E$44,4,FALSE),IF(H15=\"S\",VLOOKUP($C15,Detail!$B$4:$E$44,4,FALSE),\"\")))))","v":""},{"$f":"IF(I15=\"P\",VLOOKUP($C15,Detail!$B$4:$E$44,4,FALSE),IF(I15=\"PC\",VLOOKUP($C15,Detail!$B$4:$E$44,4,FALSE),IF(I15=\"E\",VLOOKUP($C15,Detail!$B$4:$E$44,4,FALSE),IF(I15=\"X\",VLOOKUP($C15,Detail!$B$4:$E$44,4,FALSE),IF(I15=\"S\",VLOOKUP($C15,Detail!$B$4:$E$44,4,FALSE),\"\")))))","v":""},{"$f":"IF(J15=\"P\",VLOOKUP($C15,Detail!$B$4:$E$44,4,FALSE),IF(J15=\"PC\",VLOOKUP($C15,Detail!$B$4:$E$44,4,FALSE),IF(J15=\"E\",VLOOKUP($C15,Detail!$B$4:$E$44,4,FALSE),IF(J15=\"X\",VLOOKUP($C15,Detail!$B$4:$E$44,4,FALSE),IF(J15=\"S\",VLOOKUP($C15,Detail!$B$4:$E$44,4,FALSE),\"\")))))","v":""},{"$f":"IF(K15=\"P\",VLOOKUP($C15,Detail!$B$4:$E$44,4,FALSE),IF(K15=\"PC\",VLOOKUP($C15,Detail!$B$4:$E$44,4,FALSE),IF(K15=\"E\",VLOOKUP($C15,Detail!$B$4:$E$44,4,FALSE),IF(K15=\"X\",VLOOKUP($C15,Detail!$B$4:$E$44,4,FALSE),IF(K15=\"S\",VLOOKUP($C15,Detail!$B$4:$E$44,4,FALSE),\"\")))))","v":""},{"$f":"IF(L15=\"P\",VLOOKUP($C15,Detail!$B$4:$E$44,4,FALSE),IF(L15=\"PC\",VLOOKUP($C15,Detail!$B$4:$E$44,4,FALSE),IF(L15=\"E\",VLOOKUP($C15,Detail!$B$4:$E$44,4,FALSE),IF(L15=\"X\",VLOOKUP($C15,Detail!$B$4:$E$44,4,FALSE),IF(L15=\"S\",VLOOKUP($C15,Detail!$B$4:$E$44,4,FALSE),\"\")))))","v":""},{"$f":"IF(M15=\"P\",VLOOKUP($C15,Detail!$B$4:$E$44,4,FALSE),IF(M15=\"PC\",VLOOKUP($C15,Detail!$B$4:$E$44,4,FALSE),IF(M15=\"E\",VLOOKUP($C15,Detail!$B$4:$E$44,4,FALSE),IF(M15=\"X\",VLOOKUP($C15,Detail!$B$4:$E$44,4,FALSE),IF(M15=\"S\",VLOOKUP($C15,Detail!$B$4:$E$44,4,FALSE),\"\")))))","v":""},{"$f":"IF(N15=\"P\",VLOOKUP($C15,Detail!$B$4:$E$44,4,FALSE),IF(N15=\"PC\",VLOOKUP($C15,Detail!$B$4:$E$44,4,FALSE),IF(N15=\"E\",VLOOKUP($C15,Detail!$B$4:$E$44,4,FALSE),IF(N15=\"X\",VLOOKUP($C15,Detail!$B$4:$E$44,4,FALSE),IF(N15=\"S\",VLOOKUP($C15,Detail!$B$4:$E$44,4,FALSE),\"\")))))","v":""},{"$f":"IF(O15=\"P\",VLOOKUP($C15,Detail!$B$4:$E$44,4,FALSE),IF(O15=\"PC\",VLOOKUP($C15,Detail!$B$4:$E$44,4,FALSE),IF(O15=\"E\",VLOOKUP($C15,Detail!$B$4:$E$44,4,FALSE),IF(O15=\"X\",VLOOKUP($C15,Detail!$B$4:$E$44,4,FALSE),IF(O15=\"S\",VLOOKUP($C15,Detail!$B$4:$E$44,4,FALSE),\"\")))))","v":""}]
[null,null,{"$f":"IF(ISBLANK(Detail!B17),\"\",Detail!B17)","v":""},null,null,null,null,null,null,null,null,null,null,null,null,"","",null,null,null,null,null,"",{"$f":"IF(D16=\"P\",VLOOKUP($C16,Detail!$B$4:$E$44,4,FALSE),IF(D16=\"PC\",VLOOKUP($C16,Detail!$B$4:$E$44,4,FALSE),IF(D16=\"E\",VLOOKUP($C16,Detail!$B$4:$E$44,4,FALSE),IF(D16=\"X\",VLOOKUP($C16,Detail!$B$4:$E$44,4,FALSE),IF(D16=\"S\",VLOOKUP($C16,Detail!$B$4:$E$44,4,FALSE),\"\")))))","v":""},{"$f":"IF(E16=\"P\",VLOOKUP($C16,Detail!$B$4:$E$44,4,FALSE),IF(E16=\"PC\",VLOOKUP($C16,Detail!$B$4:$E$44,4,FALSE),IF(E16=\"E\",VLOOKUP($C16,Detail!$B$4:$E$44,4,FALSE),IF(E16=\"X\",VLOOKUP($C16,Detail!$B$4:$E$44,4,FALSE),IF(E16=\"S\",VLOOKUP($C16,Detail!$B$4:$E$44,4,FALSE),\"\")))))","v":""},{"$f":"IF(F16=\"P\",VLOOKUP($C16,Detail!$B$4:$E$44,4,FALSE),IF(F16=\"PC\",VLOOKUP($C16,Detail!$B$4:$E$44,4,FALSE),IF(F16=\"E\",VLOOKUP($C16,Detail!$B$4:$E$44,4,FALSE),IF(F16=\"X\",VLOOKUP($C16,Detail!$B$4:$E$44,4,FALSE),IF(F16=\"S\",VLOOKUP($C16,Detail!$B$4:$E$44,4,FALSE),\"\")))))","v":""},{"$f":"IF(G16=\"P\",VLOOKUP($C16,Detail!$B$4:$E$44,4,FALSE),IF(G16=\"PC\",VLOOKUP($C16,Detail!$B$4:$E$44,4,FALSE),IF(G16=\"E\",VLOOKUP($C16,Detail!$B$4:$E$44,4,FALSE),IF(G16=\"X\",VLOOKUP($C16,Detail!$B$4:$E$44,4,FALSE),IF(G16=\"S\",VLOOKUP($C16,Detail!$B$4:$E$44,4,FALSE),\"\")))))","v":""},{"$f":"IF(H16=\"P\",VLOOKUP($C16,Detail!$B$4:$E$44,4,FALSE),IF(H16=\"PC\",VLOOKUP($C16,Detail!$B$4:$E$44,4,FALSE),IF(H16=\"E\",VLOOKUP($C16,Detail!$B$4:$E$44,4,FALSE),IF(H16=\"X\",VLOOKUP($C16,Detail!$B$4:$E$44,4,FALSE),IF(H16=\"S\",VLOOKUP($C16,Detail!$B$4:$E$44,4,FALSE),\"\")))))","v":""},{"$f":"IF(I16=\"P\",VLOOKUP($C16,Detail!$B$4:$E$44,4,FALSE),IF(I16=\"PC\",VLOOKUP($C16,Detail!$B$4:$E$44,4,FALSE),IF(I16=\"E\",VLOOKUP($C16,Detail!$B$4:$E$44,4,FALSE),IF(I16=\"X\",VLOOKUP($C16,Detail!$B$4:$E$44,4,FALSE),IF(I16=\"S\",VLOOKUP($C16,Detail!$B$4:$E$44,4,FALSE),\"\")))))","v":""},{"$f":"IF(J16=\"P\",VLOOKUP($C16,Detail!$B$4:$E$44,4,FALSE),IF(J16=\"PC\",VLOOKUP($C16,Detail!$B$4:$E$44,4,FALSE),IF(J16=\"E\",VLOOKUP($C16,Detail!$B$4:$E$44,4,FALSE),IF(J16=\"X\",VLOOKUP($C16,Detail!$B$4:$E$44,4,FALSE),IF(J16=\"S\",VLOOKUP($C16,Detail!$B$4:$E$44,4,FALSE),\"\")))))","v":""},{"$f":"IF(K16=\"P\",VLOOKUP($C16,Detail!$B$4:$E$44,4,FALSE),IF(K16=\"PC\",VLOOKUP($C16,Detail!$B$4:$E$44,4,FALSE),IF(K16=\"E\",VLOOKUP($C16,Detail!$B$4:$E$44,4,FALSE),IF(K16=\"X\",VLOOKUP($C16,Detail!$B$4:$E$44,4,FALSE),IF(K16=\"S\",VLOOKUP($C16,Detail!$B$4:$E$44,4,FALSE),\"\")))))","v":""},{"$f":"IF(L16=\"P\",VLOOKUP($C16,Detail!$B$4:$E$44,4,FALSE),IF(L16=\"PC\",VLOOKUP($C16,Detail!$B$4:$E$44,4,FALSE),IF(L16=\"E\",VLOOKUP($C16,Detail!$B$4:$E$44,4,FALSE),IF(L16=\"X\",VLOOKUP($C16,Detail!$B$4:$E$44,4,FALSE),IF(L16=\"S\",VLOOKUP($C16,Detail!$B$4:$E$44,4,FALSE),\"\")))))","v":""},{"$f":"IF(M16=\"P\",VLOOKUP($C16,Detail!$B$4:$E$44,4,FALSE),IF(M16=\"PC\",VLOOKUP($C16,Detail!$B$4:$E$44,4,FALSE),IF(M16=\"E\",VLOOKUP($C16,Detail!$B$4:$E$44,4,FALSE),IF(M16=\"X\",VLOOKUP($C16,Detail!$B$4:$E$44,4,FALSE),IF(M16=\"S\",VLOOKUP($C16,Detail!$B$4:$E$44,4,FALSE),\"\")))))","v":""},{"$f":"IF(N16=\"P\",VLOOKUP($C16,Detail!$B$4:$E$44,4,FALSE),IF(N16=\"PC\",VLOOKUP($C16,Detail!$B$4:$E$44,4,FALSE),IF(N16=\"E\",VLOOKUP($C16,Detail!$B$4:$E$44,4,FALSE),IF(N16=\"X\",VLOOKUP($C16,Detail!$B$4:$E$44,4,FALSE),IF(N16=\"S\",VLOOKUP($C16,Detail!$B$4:$E$44,4,FALSE),\"\")))))","v":""},{"$f":"IF(O16=\"P\",VLOOKUP($C16,Detail!$B$4:$E$44,4,FALSE),IF(O16=\"PC\",VLOOKUP($C16,Detail!$B$4:$E$44,4,FALSE),IF(O16=\"E\",VLOOKUP($C16,Detail!$B$4:$E$44,4,FALSE),IF(O16=\"X\",VLOOKUP($C16,Detail!$B$4:$E$44,4,FALSE),IF(O16=\"S\",VLOOKUP($C16,Detail!$B$4:$E$44,4,FALSE),\"\")))))","v":""}]
[null,null,{"$f":"IF(ISBLANK(Detail!B18),\"\",Detail!B18)","v":""},null,null,null,null,null,null,null,null,null,null,null,null,"","",null,null,null,null,null,"",{"$f":"IF(D17=\"P\",VLOOKUP($C17,Detail!$B$4:$E$44,4,FALSE),IF(D17=\"PC\",VLOOKUP($C17,Detail!$B$4:$E$44,4,FALSE),IF(D17=\"E\",VLOOKUP($C17,Detail!$B$4:$E$44,4,FALSE),IF(D17=\"X\",VLOOKUP($C17,Detail!$B$4:$E$44,4,FALSE),IF(D17=\"S\",VLOOKUP($C17,Detail!$B$4:$E$44,4,FALSE),\"\")))))","v":""},{"$f":"IF(E17=\"P\",VLOOKUP($C17,Detail!$B$4:$E$44,4,FALSE),IF(E17=\"PC\",VLOOKUP($C17,Detail!$B$4:$E$44,4,FALSE),IF(E17=\"E\",VLOOKUP($C17,Detail!$B$4:$E$44,4,FALSE),IF(E17=\"X\",VLOOKUP($C17,Detail!$B$4:$E$44,4,FALSE),IF(E17=\"S\",VLOOKUP($C17,Detail!$B$4:$E$44,4,FALSE),\"\")))))","v":""},{"$f":"IF(F17=\"P\",VLOOKUP($C17,Detail!$B$4:$E$44,4,FALSE),IF(F17=\"PC\",VLOOKUP($C17,Detail!$B$4:$E$44,4,FALSE),IF(F17=\"E\",VLOOKUP($C17,Detail!$B$4:$E$44,4,FALSE),IF(F17=\"X\",VLOOKUP($C17,Detail!$B$4:$E$44,4,FALSE),IF(F17=\"S\",VLOOKUP($C17,Detail!$B$4:$E$44,4,FALSE),\"\")))))","v":""},{"$f":"IF(G17=\"P\",VLOOKUP($C17,Detail!$B$4:$E$44,4,FALSE),IF(G17=\"PC\",VLOOKUP($C17,Detail!$B$4:$E$44,4,FALSE),IF(G17=\"E\",VLOOKUP($C17,Detail!$B$4:$E$44,4,FALSE),IF(G17=\"X\",VLOOKUP($C17,Detail!$B$4:$E$44,4,FALSE),IF(G17=\"S\",VLOOKUP($C17,Detail!$B$4:$E$44,4,FALSE),\"\")))))","v":""},{"$f":"IF(H17=\"P\",VLOOKUP($C17,Detail!$B$4:$E$44,4,FALSE),IF(H17=\"PC\",VLOOKUP($C17,Detail!$B$4:$E$44,4,FALSE),IF(H17=\"E\",VLOOKUP($C17,Detail!$B$4:$E$44,4,FALSE),IF(H17=\"X\",VLOOKUP($C17,Detail!$B$4:$E$44,4,FALSE),IF(H17=\"S\",VLOOKUP($C17,Detail!$B$4:$E$44,4,FALSE),\"\")))))","v":""},{"$f":"IF(I17=\"P\",VLOOKUP($C17,Detail!$B$4:$E$44,4,FALSE),IF(I17=\"PC\",VLOOKUP($C17,Detail!$B$4:$E$44,4,FALSE),IF(I17=\"E\",VLOOKUP($C17,Detail!$B$4:$E$44,4,FALSE),IF(I17=\"X\",VLOOKUP($C17,Detail!$B$4:$E$44,4,FALSE),IF(I17=\"S\",VLOOKUP($C17,Detail!$B$4:$E$44,4,FALSE),\"\")))))","v":""},{"$f":"IF(J17=\"P\",VLOOKUP($C17,Detail!$B$4:$E$44,4,FALSE),IF(J17=\"PC\",VLOOKUP($C17,Detail!$B$4:$E$44,4,FALSE),IF(J17=\"E\",VLOOKUP($C17,Detail!$B$4:$E$44,4,FALSE),IF(J17=\"X\",VLOOKUP($C17,Detail!$B$4:$E$44,4,FALSE),IF(J17=\"S\",VLOOKUP($C17,Detail!$B$4:$E$44,4,FALSE),\"\")))))","v":""},{"$f":"IF(K17=\"P\",VLOOKUP($C17,Detail!$B$4:$E$44,4,FALSE),IF(K17=\"PC\",VLOOKUP($C17,Detail!$B$4:$E$44,4,FALSE),IF(K17=\"E\",VLOOKUP($C17,Detail!$B$4:$E$44,4,FALSE),IF(K17=\"X\",VLOOKUP($C17,Detail!$B$4:$E$44,4,FALSE),IF(K17=\"S\",VLOOKUP($C17,Detail!$B$4:$E$44,4,FALSE),\"\")))))","v":""},{"$f":"IF(L17=\"P\",VLOOKUP($C17,Detail!$B$4:$E$44,4,FALSE),IF(L17=\"PC\",VLOOKUP($C17,Detail!$B$4:$E$44,4,FALSE),IF(L17=\"E\",VLOOKUP($C17,Detail!$B$4:$E$44,4,FALSE),IF(L17=\"X\",VLOOKUP($C17,Detail!$B$4:$E$44,4,FALSE),IF(L17=\"S\",VLOOKUP($C17,Detail!$B$4:$E$44,4,FALSE),\"\")))))","v":""},{"$f":"IF(M17=\"P\",VLOOKUP($C17,Detail!$B$4:$E$44,4,FALSE),IF(M17=\"PC\",VLOOKUP($C17,Detail!$B$4:$E$44,4,FALSE),IF(M17=\"E\",VLOOKUP($C17,Detail!$B$4:$E$44,4,FALSE),IF(M17=\"X\",VLOOKUP($C17,Detail!$B$4:$E$44,4,FALSE),IF(M17=\"S\",VLOOKUP($C17,Detail!$B$4:$E$44,4,FALSE),\"\")))))","v":""},{"$f":"IF(N17=\"P\",VLOOKUP($C17,Detail!$B$4:$E$44,4,FALSE),IF(N17=\"PC\",VLOOKUP($C17,Detail!$B$4:$E$44,4,FALSE),IF(N17=\"E\",VLOOKUP($C17,Detail!$B$4:$E$44,4,FALSE),IF(N17=\"X\",VLOOKUP($C17,Detail!$B$4:$E$44,4,FALSE),IF(N17=\"S\",VLOOKUP($C17,Detail!$B$4:$E$44,4,FALSE),\"\")))))","v":""},{"$f":"IF(O17=\"P\",VLOOKUP($C17,Detail!$B$4:$E$44,4,FALSE),IF(O17=\"PC\",VLOOKUP($C17,Detail!$B$4:$E$44,4,FALSE),IF(O17=\"E\",VLOOKUP($C17,Detail!$B$4:$E$44,4,FALSE),IF(O17=\"X\",VLOOKUP($C17,Detail!$B$4:$E$44,4,FALSE),IF(O17=\"S\",VLOOKUP($C17,Detail!$B$4:$E$44,4,FALSE),\"\")))))","v":""}]
[null,null,{"$f":"IF(ISBLANK(Detail!B19),\"\",Detail!B19)","v":""},null,null,null,null,null,null,null,null,null,null,null,null,"","",null,null,null,null,null,"",{"$f":"IF(D18=\"P\",VLOOKUP($C18,Detail!$B$4:$E$44,4,FALSE),IF(D18=\"PC\",VLOOKUP($C18,Detail!$B$4:$E$44,4,FALSE),IF(D18=\"E\",VLOOKUP($C18,Detail!$B$4:$E$44,4,FALSE),IF(D18=\"X\",VLOOKUP($C18,Detail!$B$4:$E$44,4,FALSE),IF(D18=\"S\",VLOOKUP($C18,Detail!$B$4:$E$44,4,FALSE),\"\")))))","v":""},{"$f":"IF(E18=\"P\",VLOOKUP($C18,Detail!$B$4:$E$44,4,FALSE),IF(E18=\"PC\",VLOOKUP($C18,Detail!$B$4:$E$44,4,FALSE),IF(E18=\"E\",VLOOKUP($C18,Detail!$B$4:$E$44,4,FALSE),IF(E18=\"X\",VLOOKUP($C18,Detail!$B$4:$E$44,4,FALSE),IF(E18=\"S\",VLOOKUP($C18,Detail!$B$4:$E$44,4,FALSE),\"\")))))","v":""},{"$f":"IF(F18=\"P\",VLOOKUP($C18,Detail!$B$4:$E$44,4,FALSE),IF(F18=\"PC\",VLOOKUP($C18,Detail!$B$4:$E$44,4,FALSE),IF(F18=\"E\",VLOOKUP($C18,Detail!$B$4:$E$44,4,FALSE),IF(F18=\"X\",VLOOKUP($C18,Detail!$B$4:$E$44,4,FALSE),IF(F18=\"S\",VLOOKUP($C18,Detail!$B$4:$E$44,4,FALSE),\"\")))))","v":""},{"$f":"IF(G18=\"P\",VLOOKUP($C18,Detail!$B$4:$E$44,4,FALSE),IF(G18=\"PC\",VLOOKUP($C18,Detail!$B$4:$E$44,4,FALSE),IF(G18=\"E\",VLOOKUP($C18,Detail!$B$4:$E$44,4,FALSE),IF(G18=\"X\",VLOOKUP($C18,Detail!$B$4:$E$44,4,FALSE),IF(G18=\"S\",VLOOKUP($C18,Detail!$B$4:$E$44,4,FALSE),\"\")))))","v":""},{"$f":"IF(H18=\"P\",VLOOKUP($C18,Detail!$B$4:$E$44,4,FALSE),IF(H18=\"PC\",VLOOKUP($C18,Detail!$B$4:$E$44,4,FALSE),IF(H18=\"E\",VLOOKUP($C18,Detail!$B$4:$E$44,4,FALSE),IF(H18=\"X\",VLOOKUP($C18,Detail!$B$4:$E$44,4,FALSE),IF(H18=\"S\",VLOOKUP($C18,Detail!$B$4:$E$44,4,FALSE),\"\")))))","v":""},{"$f":"IF(I18=\"P\",VLOOKUP($C18,Detail!$B$4:$E$44,4,FALSE),IF(I18=\"PC\",VLOOKUP($C18,Detail!$B$4:$E$44,4,FALSE),IF(I18=\"E\",VLOOKUP($C18,Detail!$B$4:$E$44,4,FALSE),IF(I18=\"X\",VLOOKUP($C18,Detail!$B$4:$E$44,4,FALSE),IF(I18=\"S\",VLOOKUP($C18,Detail!$B$4:$E$44,4,FALSE),\"\")))))","v":""},{"$f":"IF(J18=\"P\",VLOOKUP($C18,Detail!$B$4:$E$44,4,FALSE),IF(J18=\"PC\",VLOOKUP($C18,Detail!$B$4:$E$44,4,FALSE),IF(J18=\"E\",VLOOKUP($C18,Detail!$B$4:$E$44,4,FALSE),IF(J18=\"X\",VLOOKUP($C18,Detail!$B$4:$E$44,4,FALSE),IF(J18=\"S\",VLOOKUP($C18,Detail!$B$4:$E$44,4,FALSE),\"\")))))","v":""},{"$f":"IF(K18=\"P\",VLOOKUP($C18,Detail!$B$4:$E$44,4,FALSE),IF(K18=\"PC\",VLOOKUP($C18,Detail!$B$4:$E$44,4,FALSE),IF(K18=\"E\",VLOOKUP($C18,Detail!$B$4:$E$44,4,FALSE),IF(K18=\"X\",VLOOKUP($C18,Detail!$B$4:$E$44,4,FALSE),IF(K18=\"S\",VLOOKUP($C18,Detail!$B$4:$E$44,4,FALSE),\"\")))))","v":""},{"$f":"IF(L18=\"P\",VLOOKUP($C18,Detail!$B$4:$E$44,4,FALSE),IF(L18=\"PC\",VLOOKUP($C18,Detail!$B$4:$E$44,4,FALSE),IF(L18=\"E\",VLOOKUP($C18,Detail!$B$4:$E$44,4,FALSE),IF(L18=\"X\",VLOOKUP($C18,Detail!$B$4:$E$44,4,FALSE),IF(L18=\"S\",VLOOKUP($C18,Detail!$B$4:$E$44,4,FALSE),\"\")))))","v":""},{"$f":"IF(M18=\"P\",VLOOKUP($C18,Detail!$B$4:$E$44,4,FALSE),IF(M18=\"PC\",VLOOKUP($C18,Detail!$B$4:$E$44,4,FALSE),IF(M18=\"E\",VLOOKUP($C18,Detail!$B$4:$E$44,4,FALSE),IF(M18=\"X\",VLOOKUP($C18,Detail!$B$4:$E$44,4,FALSE),IF(M18=\"S\",VLOOKUP($C18,Detail!$B$4:$E$44,4,FALSE),\"\")))))","v":""},{"$f":"IF(N18=\"P\",VLOOKUP($C18,Detail!$B$4:$E$44,4,FALSE),IF(N18=\"PC\",VLOOKUP($C18,Detail!$B$4:$E$44,4,FALSE),IF(N18=\"E\",VLOOKUP($C18,Detail!$B$4:$E$44,4,FALSE),IF(N18=\"X\",VLOOKUP($C18,Detail!$B$4:$E$44,4,FALSE),IF(N18=\"S\",VLOOKUP($C18,Detail!$B$4:$E$44,4,FALSE),\"\")))))","v":""},{"$f":"IF(O18=\"P\",VLOOKUP($C18,Detail!$B$4:$E$44,4,FALSE),IF(O18=\"PC\",VLOOKUP($C18,Detail!$B$4:$E$44,4,FALSE),IF(O18=\"E\",VLOOKUP($C18,Detail!$B$4:$E$44,4,FALSE),IF(O18=\"X\",VLOOKUP($C18,Detail!$B$4:$E$44,4,FALSE),IF(O18=\"S\",VLOOKUP($C18,Detail!$B$4:$E$44,4,FALSE),\"\")))))","v":""}]
[null,null,{"$f":"IF(ISBLANK(Detail!B20),\"\",Detail!B20)","v":""},null,null,null,null,null,null,null,null,null,null,null,null,"","",null,null,null,null,null,"",{"$f":"IF(D19=\"P\",VLOOKUP($C19,Detail!$B$4:$E$44,4,FALSE),IF(D19=\"PC\",VLOOKUP($C19,Detail!$B$4:$E$44,4,FALSE),IF(D19=\"E\",VLOOKUP($C19,Detail!$B$4:$E$44,4,FALSE),IF(D19=\"X\",VLOOKUP($C19,Detail!$B$4:$E$44,4,FALSE),IF(D19=\"S\",VLOOKUP($C19,Detail!$B$4:$E$44,4,FALSE),\"\")))))","v":""},{"$f":"IF(E19=\"P\",VLOOKUP($C19,Detail!$B$4:$E$44,4,FALSE),IF(E19=\"PC\",VLOOKUP($C19,Detail!$B$4:$E$44,4,FALSE),IF(E19=\"E\",VLOOKUP($C19,Detail!$B$4:$E$44,4,FALSE),IF(E19=\"X\",VLOOKUP($C19,Detail!$B$4:$E$44,4,FALSE),IF(E19=\"S\",VLOOKUP($C19,Detail!$B$4:$E$44,4,FALSE),\"\")))))","v":""},{"$f":"IF(F19=\"P\",VLOOKUP($C19,Detail!$B$4:$E$44,4,FALSE),IF(F19=\"PC\",VLOOKUP($C19,Detail!$B$4:$E$44,4,FALSE),IF(F19=\"E\",VLOOKUP($C19,Detail!$B$4:$E$44,4,FALSE),IF(F19=\"X\",VLOOKUP($C19,Detail!$B$4:$E$44,4,FALSE),IF(F19=\"S\",VLOOKUP($C19,Detail!$B$4:$E$44,4,FALSE),\"\")))))","v":""},{"$f":"IF(G19=\"P\",VLOOKUP($C19,Detail!$B$4:$E$44,4,FALSE),IF(G19=\"PC\",VLOOKUP($C19,Detail!$B$4:$E$44,4,FALSE),IF(G19=\"E\",VLOOKUP($C19,Detail!$B$4:$E$44,4,FALSE),IF(G19=\"X\",VLOOKUP($C19,Detail!$B$4:$E$44,4,FALSE),IF(G19=\"S\",VLOOKUP($C19,Detail!$B$4:$E$44,4,FALSE),\"\")))))","v":""},{"$f":"IF(H19=\"P\",VLOOKUP($C19,Detail!$B$4:$E$44,4,FALSE),IF(H19=\"PC\",VLOOKUP($C19,Detail!$B$4:$E$44,4,FALSE),IF(H19=\"E\",VLOOKUP($C19,Detail!$B$4:$E$44,4,FALSE),IF(H19=\"X\",VLOOKUP($C19,Detail!$B$4:$E$44,4,FALSE),IF(H19=\"S\",VLOOKUP($C19,Detail!$B$4:$E$44,4,FALSE),\"\")))))","v":""},{"$f":"IF(I19=\"P\",VLOOKUP($C19,Detail!$B$4:$E$44,4,FALSE),IF(I19=\"PC\",VLOOKUP($C19,Detail!$B$4:$E$44,4,FALSE),IF(I19=\"E\",VLOOKUP($C19,Detail!$B$4:$E$44,4,FALSE),IF(I19=\"X\",VLOOKUP($C19,Detail!$B$4:$E$44,4,FALSE),IF(I19=\"S\",VLOOKUP($C19,Detail!$B$4:$E$44,4,FALSE),\"\")))))","v":""},{"$f":"IF(J19=\"P\",VLOOKUP($C19,Detail!$B$4:$E$44,4,FALSE),IF(J19=\"PC\",VLOOKUP($C19,Detail!$B$4:$E$44,4,FALSE),IF(J19=\"E\",VLOOKUP($C19,Detail!$B$4:$E$44,4,FALSE),IF(J19=\"X\",VLOOKUP($C19,Detail!$B$4:$E$44,4,FALSE),IF(J19=\"S\",VLOOKUP($C19,Detail!$B$4:$E$44,4,FALSE),\"\")))))","v":""},{"$f":"IF(K19=\"P\",VLOOKUP($C19,Detail!$B$4:$E$44,4,FALSE),IF(K19=\"PC\",VLOOKUP($C19,Detail!$B$4:$E$44,4,FALSE),IF(K19=\"E\",VLOOKUP($C19,Detail!$B$4:$E$44,4,FALSE),IF(K19=\"X\",VLOOKUP($C19,Detail!$B$4:$E$44,4,FALSE),IF(K19=\"S\",VLOOKUP($C19,Detail!$B$4:$E$44,4,FALSE),\"\")))))","v":""},{"$f":"IF(L19=\"P\",VLOOKUP($C19,Detail!$B$4:$E$44,4,FALSE),IF(L19=\"PC\",VLOOKUP($C19,Detail!$B$4:$E$44,4,FALSE),IF(L19=\"E\",VLOOKUP($C19,Detail!$B$4:$E$44,4,FALSE),IF(L19=\"X\",VLOOKUP($C19,Detail!$B$4:$E$44,4,FALSE),IF(L19=\"S\",VLOOKUP($C19,Detail!$B$4:$E$44,4,FALSE),\"\")))))","v":""},{"$f":"IF(M19=\"P\",VLOOKUP($C19,Detail!$B$4:$E$44,4,FALSE),IF(M19=\"PC\",VLOOKUP($C19,Detail!$B$4:$E$44,4,FALSE),IF(M19=\"E\",VLOOKUP($C19,Detail!$B$4:$E$44,4,FALSE),IF(M19=\"X\",VLOOKUP($C19,Detail!$B$4:$E$44,4,FALSE),IF(M19=\"S\",VLOOKUP($C19,Detail!$B$4:$E$44,4,FALSE),\"\")))))","v":""},{"$f":"IF(N19=\"P\",VLOOKUP($C19,Detail!$B$4:$E$44,4,FALSE),IF(N19=\"PC\",VLOOKUP($C19,Detail!$B$4:$E$44,4,FALSE),IF(N19=\"E\",VLOOKUP($C19,Detail!$B$4:$E$44,4,FALSE),IF(N19=\"X\",VLOOKUP($C19,Detail!$B$4:$E$44,4,FALSE),IF(N19=\"S\",VLOOKUP($C19,Detail!$B$4:$E$44,4,FALSE),\"\")))))","v":""},{"$f":"IF(O19=\"P\",VLOOKUP($C19,Detail!$B$4:$E$44,4,FALSE),IF(O19=\"PC\",VLOOKUP($C19,Detail!$B$4:$E$44,4,FALSE),IF(O19=\"E\",VLOOKUP($C19,Detail!$B$4:$E$44,4,FALSE),IF(O19=\"X\",VLOOKUP($C19,Detail!$B$4:$E$44,4,FALSE),IF(O19=\"S\",VLOOKUP($C19,Detail!$B$4:$E$44,4,FALSE),\"\")))))","v":""}]
[null,null,{"$f":"IF(ISBLANK(Detail!B21),\"\",Detail!B21)","v":""},null,null,null,null,null,null,null,null,null,null,null,null,"","",null,null,null,null,null,"",{"$f":"IF(D20=\"P\",VLOOKUP($C20,Detail!$B$4:$E$44,4,FALSE),IF(D20=\"PC\",VLOOKUP($C20,Detail!$B$4:$E$44,4,FALSE),IF(D20=\"E\",VLOOKUP($C20,Detail!$B$4:$E$44,4,FALSE),IF(D20=\"X\",VLOOKUP($C20,Detail!$B$4:$E$44,4,FALSE),IF(D20=\"S\",VLOOKUP($C20,Detail!$B$4:$E$44,4,FALSE),\"\")))))","v":""},{"$f":"IF(E20=\"P\",VLOOKUP($C20,Detail!$B$4:$E$44,4,FALSE),IF(E20=\"PC\",VLOOKUP($C20,Detail!$B$4:$E$44,4,FALSE),IF(E20=\"E\",VLOOKUP($C20,Detail!$B$4:$E$44,4,FALSE),IF(E20=\"X\",VLOOKUP($C20,Detail!$B$4:$E$44,4,FALSE),IF(E20=\"S\",VLOOKUP($C20,Detail!$B$4:$E$44,4,FALSE),\"\")))))","v":""},{"$f":"IF(F20=\"P\",VLOOKUP($C20,Detail!$B$4:$E$44,4,FALSE),IF(F20=\"PC\",VLOOKUP($C20,Detail!$B$4:$E$44,4,FALSE),IF(F20=\"E\",VLOOKUP($C20,Detail!$B$4:$E$44,4,FALSE),IF(F20=\"X\",VLOOKUP($C20,Detail!$B$4:$E$44,4,FALSE),IF(F20=\"S\",VLOOKUP($C20,Detail!$B$4:$E$44,4,FALSE),\"\")))))","v":""},{"$f":"IF(G20=\"P\",VLOOKUP($C20,Detail!$B$4:$E$44,4,FALSE),IF(G20=\"PC\",VLOOKUP($C20,Detail!$B$4:$E$44,4,FALSE),IF(G20=\"E\",VLOOKUP($C20,Detail!$B$4:$E$44,4,FALSE),IF(G20=\"X\",VLOOKUP($C20,Detail!$B$4:$E$44,4,FALSE),IF(G20=\"S\",VLOOKUP($C20,Detail!$B$4:$E$44,4,FALSE),\"\")))))","v":""},{"$f":"IF(H20=\"P\",VLOOKUP($C20,Detail!$B$4:$E$44,4,FALSE),IF(H20=\"PC\",VLOOKUP($C20,Detail!$B$4:$E$44,4,FALSE),IF(H20=\"E\",VLOOKUP($C20,Detail!$B$4:$E$44,4,FALSE),IF(H20=\"X\",VLOOKUP($C20,Detail!$B$4:$E$44,4,FALSE),IF(H20=\"S\",VLOOKUP($C20,Detail!$B$4:$E$44,4,FALSE),\"\")))))","v":""},{"$f":"IF(I20=\"P\",VLOOKUP($C20,Detail!$B$4:$E$44,4,FALSE),IF(I20=\"PC\",VLOOKUP($C20,Detail!$B$4:$E$44,4,FALSE),IF(I20=\"E\",VLOOKUP($C20,Detail!$B$4:$E$44,4,FALSE),IF(I20=\"X\",VLOOKUP($C20,Detail!$B$4:$E$44,4,FALSE),IF(I20=\"S\",VLOOKUP($C20,Detail!$B$4:$E$44,4,FALSE),\"\")))))","v":""},{"$f":"IF(J20=\"P\",VLOOKUP($C20,Detail!$B$4:$E$44,4,FALSE),IF(J20=\"PC\",VLOOKUP($C20,Detail!$B$4:$E$44,4,FALSE),IF(J20=\"E\",VLOOKUP($C20,Detail!$B$4:$E$44,4,FALSE),IF(J20=\"X\",VLOOKUP($C20,Detail!$B$4:$E$44,4,FALSE),IF(J20=\"S\",VLOOKUP($C20,Detail!$B$4:$E$44,4,FALSE),\"\")))))","v":""},{"$f":"IF(K20=\"P\",VLOOKUP($C20,Detail!$B$4:$E$44,4,FALSE),IF(K20=\"PC\",VLOOKUP($C20,Detail!$B$4:$E$44,4,FALSE),IF(K20=\"E\",VLOOKUP($C20,Detail!$B$4:$E$44,4,FALSE),IF(K20=\"X\",VLOOKUP($C20,Detail!$B$4:$E$44,4,FALSE),IF(K20=\"S\",VLOOKUP($C20,Detail!$B$4:$E$44,4,FALSE),\"\")))))","v":""},{"$f":"IF(L20=\"P\",VLOOKUP($C20,Detail!$B$4:$E$44,4,FALSE),IF(L20=\"PC\",VLOOKUP($C20,Detail!$B$4:$E$44,4,FALSE),IF(L20=\"E\",VLOOKUP($C20,Detail!$B$4:$E$44,4,FALSE),IF(L20=\"X\",VLOOKUP($C20,Detail!$B$4:$E$44,4,FALSE),IF(L20=\"S\",VLOOKUP($C20,Detail!$B$4:$E$44,4,FALSE),\"\")))))","v":""},{"$f":"IF(M20=\"P\",VLOOKUP($C20,Detail!$B$4:$E$44,4,FALSE),IF(M20=\"PC\",VLOOKUP($C20,Detail!$B$4:$E$44,4,FALSE),IF(M20=\"E\",VLOOKUP($C20,Detail!$B$4:$E$44,4,FALSE),IF(M20=\"X\",VLOOKUP($C20,Detail!$B$4:$E$44,4,FALSE),IF(M20=\"S\",VLOOKUP($C20,Detail!$B$4:$E$44,4,FALSE),\"\")))))","v":""},{"$f":"IF(N20=\"P\",VLOOKUP($C20,Detail!$B$4:$E$44,4,FALSE),IF(N20=\"PC\",VLOOKUP($C20,Detail!$B$4:$E$44,4,FALSE),IF(N20=\"E\",VLOOKUP($C20,Detail!$B$4:$E$44,4,FALSE),IF(N20=\"X\",VLOOKUP($C20,Detail!$B$4:$E$44,4,FALSE),IF(N20=\"S\",VLOOKUP($C20,Detail!$B$4:$E$44,4,FALSE),\"\")))))","v":""},{"$f":"IF(O20=\"P\",VLOOKUP($C20,Detail!$B$4:$E$44,4,FALSE),IF(O20=\"PC\",VLOOKUP($C20,Detail!$B$4:$E$44,4,FALSE),IF(O20=\"E\",VLOOKUP($C20,Detail!$B$4:$E$44,4,FALSE),IF(O20=\"X\",VLOOKUP($C20,Detail!$B$4:$E$44,4,FALSE),IF(O20=\"S\",VLOOKUP($C20,Detail!$B$4:$E$44,4,FALSE),\"\")))))","v":""}]
[null,null,{"$f":"IF(ISBLANK(Detail!B22),\"\",Detail!B22)","v":""},null,null,null,null,null,null,null,null,null,null,null,null,"","",null,null,null,null,null,"",{"$f":"IF(D21=\"P\",VLOOKUP($C21,Detail!$B$4:$E$44,4,FALSE),IF(D21=\"PC\",VLOOKUP($C21,Detail!$B$4:$E$44,4,FALSE),IF(D21=\"E\",VLOOKUP($C21,Detail!$B$4:$E$44,4,FALSE),IF(D21=\"X\",VLOOKUP($C21,Detail!$B$4:$E$44,4,FALSE),IF(D21=\"S\",VLOOKUP($C21,Detail!$B$4:$E$44,4,FALSE),\"\")))))","v":""},{"$f":"IF(E21=\"P\",VLOOKUP($C21,Detail!$B$4:$E$44,4,FALSE),IF(E21=\"PC\",VLOOKUP($C21,Detail!$B$4:$E$44,4,FALSE),IF(E21=\"E\",VLOOKUP($C21,Detail!$B$4:$E$44,4,FALSE),IF(E21=\"X\",VLOOKUP($C21,Detail!$B$4:$E$44,4,FALSE),IF(E21=\"S\",VLOOKUP($C21,Detail!$B$4:$E$44,4,FALSE),\"\")))))","v":""},{"$f":"IF(F21=\"P\",VLOOKUP($C21,Detail!$B$4:$E$44,4,FALSE),IF(F21=\"PC\",VLOOKUP($C21,Detail!$B$4:$E$44,4,FALSE),IF(F21=\"E\",VLOOKUP($C21,Detail!$B$4:$E$44,4,FALSE),IF(F21=\"X\",VLOOKUP($C21,Detail!$B$4:$E$44,4,FALSE),IF(F21=\"S\",VLOOKUP($C21,Detail!$B$4:$E$44,4,FALSE),\"\")))))","v":""},{"$f":"IF(G21=\"P\",VLOOKUP($C21,Detail!$B$4:$E$44,4,FALSE),IF(G21=\"PC\",VLOOKUP($C21,Detail!$B$4:$E$44,4,FALSE),IF(G21=\"E\",VLOOKUP($C21,Detail!$B$4:$E$44,4,FALSE),IF(G21=\"X\",VLOOKUP($C21,Detail!$B$4:$E$44,4,FALSE),IF(G21=\"S\",VLOOKUP($C21,Detail!$B$4:$E$44,4,FALSE),\"\")))))","v":""},{"$f":"IF(H21=\"P\",VLOOKUP($C21,Detail!$B$4:$E$44,4,FALSE),IF(H21=\"PC\",VLOOKUP($C21,Detail!$B$4:$E$44,4,FALSE),IF(H21=\"E\",VLOOKUP($C21,Detail!$B$4:$E$44,4,FALSE),IF(H21=\"X\",VLOOKUP($C21,Detail!$B$4:$E$44,4,FALSE),IF(H21=\"S\",VLOOKUP($C21,Detail!$B$4:$E$44,4,FALSE),\"\")))))","v":""},{"$f":"IF(I21=\"P\",VLOOKUP($C21,Detail!$B$4:$E$44,4,FALSE),IF(I21=\"PC\",VLOOKUP($C21,Detail!$B$4:$E$44,4,FALSE),IF(I21=\"E\",VLOOKUP($C21,Detail!$B$4:$E$44,4,FALSE),IF(I21=\"X\",VLOOKUP($C21,Detail!$B$4:$E$44,4,FALSE),IF(I21=\"S\",VLOOKUP($C21,Detail!$B$4:$E$44,4,FALSE),\"\")))))","v":""},{"$f":"IF(J21=\"P\",VLOOKUP($C21,Detail!$B$4:$E$44,4,FALSE),IF(J21=\"PC\",VLOOKUP($C21,Detail!$B$4:$E$44,4,FALSE),IF(J21=\"E\",VLOOKUP($C21,Detail!$B$4:$E$44,4,FALSE),IF(J21=\"X\",VLOOKUP($C21,Detail!$B$4:$E$44,4,FALSE),IF(J21=\"S\",VLOOKUP($C21,Detail!$B$4:$E$44,4,FALSE),\"\")))))","v":""},{"$f":"IF(K21=\"P\",VLOOKUP($C21,Detail!$B$4:$E$44,4,FALSE),IF(K21=\"PC\",VLOOKUP($C21,Detail!$B$4:$E$44,4,FALSE),IF(K21=\"E\",VLOOKUP($C21,Detail!$B$4:$E$44,4,FALSE),IF(K21=\"X\",VLOOKUP($C21,Detail!$B$4:$E$44,4,FALSE),IF(K21=\"S\",VLOOKUP($C21,Detail!$B$4:$E$44,4,FALSE),\"\")))))","v":""},{"$f":"IF(L21=\"P\",VLOOKUP($C21,Detail!$B$4:$E$44,4,FALSE),IF(L21=\"PC\",VLOOKUP($C21,Detail!$B$4:$E$44,4,FALSE),IF(L21=\"E\",VLOOKUP($C21,Detail!$B$4:$E$44,4,FALSE),IF(L21=\"X\",VLOOKUP($C21,Detail!$B$4:$E$44,4,FALSE),IF(L21=\"S\",VLOOKUP($C21,Detail!$B$4:$E$44,4,FALSE),\"\")))))","v":""},{"$f":"IF(M21=\"P\",VLOOKUP($C21,Detail!$B$4:$E$44,4,FALSE),IF(M21=\"PC\",VLOOKUP($C21,Detail!$B$4:$E$44,4,FALSE),IF(M21=\"E\",VLOOKUP($C21,Detail!$B$4:$E$44,4,FALSE),IF(M21=\"X\",VLOOKUP($C21,Detail!$B$4:$E$44,4,FALSE),IF(M21=\"S\",VLOOKUP($C21,Detail!$B$4:$E$44,4,FALSE),\"\")))))","v":""},{"$f":"IF(N21=\"P\",VLOOKUP($C21,Detail!$B$4:$E$44,4,FALSE),IF(N21=\"PC\",VLOOKUP($C21,Detail!$B$4:$E$44,4,FALSE),IF(N21=\"E\",VLOOKUP($C21,Detail!$B$4:$E$44,4,FALSE),IF(N21=\"X\",VLOOKUP($C21,Detail!$B$4:$E$44,4,FALSE),IF(N21=\"S\",VLOOKUP($C21,Detail!$B$4:$E$44,4,FALSE),\"\")))))","v":""},{"$f":"IF(O21=\"P\",VLOOKUP($C21,Detail!$B$4:$E$44,4,FALSE),IF(O21=\"PC\",VLOOKUP($C21,Detail!$B$4:$E$44,4,FALSE),IF(O21=\"E\",VLOOKUP($C21,Detail!$B$4:$E$44,4,FALSE),IF(O21=\"X\",VLOOKUP($C21,Detail!$B$4:$E$44,4,FALSE),IF(O21=\"S\",VLOOKUP($C21,Detail!$B$4:$E$44,4,FALSE),\"\")))))","v":""}]
[null,null,{"$f":"IF(ISBLANK(Detail!B23),\"\",Detail!B23)","v":""},null,null,null,null,null,null,null,null,null,null,null,null,"","",null,null,null,null,null,"",{"$f":"IF(D22=\"P\",VLOOKUP($C22,Detail!$B$4:$E$44,4,FALSE),IF(D22=\"PC\",VLOOKUP($C22,Detail!$B$4:$E$44,4,FALSE),IF(D22=\"E\",VLOOKUP($C22,Detail!$B$4:$E$44,4,FALSE),IF(D22=\"X\",VLOOKUP($C22,Detail!$B$4:$E$44,4,FALSE),IF(D22=\"S\",VLOOKUP($C22,Detail!$B$4:$E$44,4,FALSE),\"\")))))","v":""},{"$f":"IF(E22=\"P\",VLOOKUP($C22,Detail!$B$4:$E$44,4,FALSE),IF(E22=\"PC\",VLOOKUP($C22,Detail!$B$4:$E$44,4,FALSE),IF(E22=\"E\",VLOOKUP($C22,Detail!$B$4:$E$44,4,FALSE),IF(E22=\"X\",VLOOKUP($C22,Detail!$B$4:$E$44,4,FALSE),IF(E22=\"S\",VLOOKUP($C22,Detail!$B$4:$E$44,4,FALSE),\"\")))))","v":""},{"$f":"IF(F22=\"P\",VLOOKUP($C22,Detail!$B$4:$E$44,4,FALSE),IF(F22=\"PC\",VLOOKUP($C22,Detail!$B$4:$E$44,4,FALSE),IF(F22=\"E\",VLOOKUP($C22,Detail!$B$4:$E$44,4,FALSE),IF(F22=\"X\",VLOOKUP($C22,Detail!$B$4:$E$44,4,FALSE),IF(F22=\"S\",VLOOKUP($C22,Detail!$B$4:$E$44,4,FALSE),\"\")))))","v":""},{"$f":"IF(G22=\"P\",VLOOKUP($C22,Detail!$B$4:$E$44,4,FALSE),IF(G22=\"PC\",VLOOKUP($C22,Detail!$B$4:$E$44,4,FALSE),IF(G22=\"E\",VLOOKUP($C22,Detail!$B$4:$E$44,4,FALSE),IF(G22=\"X\",VLOOKUP($C22,Detail!$B$4:$E$44,4,FALSE),IF(G22=\"S\",VLOOKUP($C22,Detail!$B$4:$E$44,4,FALSE),\"\")))))","v":""},{"$f":"IF(H22=\"P\",VLOOKUP($C22,Detail!$B$4:$E$44,4,FALSE),IF(H22=\"PC\",VLOOKUP($C22,Detail!$B$4:$E$44,4,FALSE),IF(H22=\"E\",VLOOKUP($C22,Detail!$B$4:$E$44,4,FALSE),IF(H22=\"X\",VLOOKUP($C22,Detail!$B$4:$E$44,4,FALSE),IF(H22=\"S\",VLOOKUP($C22,Detail!$B$4:$E$44,4,FALSE),\"\")))))","v":""},{"$f":"IF(I22=\"P\",VLOOKUP($C22,Detail!$B$4:$E$44,4,FALSE),IF(I22=\"PC\",VLOOKUP($C22,Detail!$B$4:$E$44,4,FALSE),IF(I22=\"E\",VLOOKUP($C22,Detail!$B$4:$E$44,4,FALSE),IF(I22=\"X\",VLOOKUP($C22,Detail!$B$4:$E$44,4,FALSE),IF(I22=\"S\",VLOOKUP($C22,Detail!$B$4:$E$44,4,FALSE),\"\")))))","v":""},{"$f":"IF(J22=\"P\",VLOOKUP($C22,Detail!$B$4:$E$44,4,FALSE),IF(J22=\"PC\",VLOOKUP($C22,Detail!$B$4:$E$44,4,FALSE),IF(J22=\"E\",VLOOKUP($C22,Detail!$B$4:$E$44,4,FALSE),IF(J22=\"X\",VLOOKUP($C22,Detail!$B$4:$E$44,4,FALSE),IF(J22=\"S\",VLOOKUP($C22,Detail!$B$4:$E$44,4,FALSE),\"\")))))","v":""},{"$f":"IF(K22=\"P\",VLOOKUP($C22,Detail!$B$4:$E$44,4,FALSE),IF(K22=\"PC\",VLOOKUP($C22,Detail!$B$4:$E$44,4,FALSE),IF(K22=\"E\",VLOOKUP($C22,Detail!$B$4:$E$44,4,FALSE),IF(K22=\"X\",VLOOKUP($C22,Detail!$B$4:$E$44,4,FALSE),IF(K22=\"S\",VLOOKUP($C22,Detail!$B$4:$E$44,4,FALSE),\"\")))))","v":""},{"$f":"IF(L22=\"P\",VLOOKUP($C22,Detail!$B$4:$E$44,4,FALSE),IF(L22=\"PC\",VLOOKUP($C22,Detail!$B$4:$E$44,4,FALSE),IF(L22=\"E\",VLOOKUP($C22,Detail!$B$4:$E$44,4,FALSE),IF(L22=\"X\",VLOOKUP($C22,Detail!$B$4:$E$44,4,FALSE),IF(L22=\"S\",VLOOKUP($C22,Detail!$B$4:$E$44,4,FALSE),\"\")))))","v":""},{"$f":"IF(M22=\"P\",VLOOKUP($C22,Detail!$B$4:$E$44,4,FALSE),IF(M22=\"PC\",VLOOKUP($C22,Detail!$B$4:$E$44,4,FALSE),IF(M22=\"E\",VLOOKUP($C22,Detail!$B$4:$E$44,4,FALSE),IF(M22=\"X\",VLOOKUP($C22,Detail!$B$4:$E$44,4,FALSE),IF(M22=\"S\",VLOOKUP($C22,Detail!$B$4:$E$44,4,FALSE),\"\")))))","v":""},{"$f":"IF(N22=\"P\",VLOOKUP($C22,Detail!$B$4:$E$44,4,FALSE),IF(N22=\"PC\",VLOOKUP($C22,Detail!$B$4:$E$44,4,FALSE),IF(N22=\"E\",VLOOKUP($C22,Detail!$B$4:$E$44,4,FALSE),IF(N22=\"X\",VLOOKUP($C22,Detail!$B$4:$E$44,4,FALSE),IF(N22=\"S\",VLOOKUP($C22,Detail!$B$4:$E$44,4,FALSE),\"\")))))","v":""},{"$f":"IF(O22=\"P\",VLOOKUP($C22,Detail!$B$4:$E$44,4,FALSE),IF(O22=\"PC\",VLOOKUP($C22,Detail!$B$4:$E$44,4,FALSE),IF(O22=\"E\",VLOOKUP($C22,Detail!$B$4:$E$44,4,FALSE),IF(O22=\"X\",VLOOKUP($C22,Detail!$B$4:$E$44,4,FALSE),IF(O22=\"S\",VLOOKUP($C22,Detail!$B$4:$E$44,4,FALSE),\"\")))))","v":""}]
[null,null,{"$f":"IF(ISBLANK(Detail!B24),\"\",Detail!B24)","v":""},null,null,null,null,null,null,null,null,null,null,null,null,"","",null,null,null,null,null,"",{"$f":"IF(D23=\"P\",VLOOKUP($C23,Detail!$B$4:$E$44,4,FALSE),IF(D23=\"PC\",VLOOKUP($C23,Detail!$B$4:$E$44,4,FALSE),IF(D23=\"E\",VLOOKUP($C23,Detail!$B$4:$E$44,4,FALSE),IF(D23=\"X\",VLOOKUP($C23,Detail!$B$4:$E$44,4,FALSE),IF(D23=\"S\",VLOOKUP($C23,Detail!$B$4:$E$44,4,FALSE),\"\")))))","v":""},{"$f":"IF(E23=\"P\",VLOOKUP($C23,Detail!$B$4:$E$44,4,FALSE),IF(E23=\"PC\",VLOOKUP($C23,Detail!$B$4:$E$44,4,FALSE),IF(E23=\"E\",VLOOKUP($C23,Detail!$B$4:$E$44,4,FALSE),IF(E23=\"X\",VLOOKUP($C23,Detail!$B$4:$E$44,4,FALSE),IF(E23=\"S\",VLOOKUP($C23,Detail!$B$4:$E$44,4,FALSE),\"\")))))","v":""},{"$f":"IF(F23=\"P\",VLOOKUP($C23,Detail!$B$4:$E$44,4,FALSE),IF(F23=\"PC\",VLOOKUP($C23,Detail!$B$4:$E$44,4,FALSE),IF(F23=\"E\",VLOOKUP($C23,Detail!$B$4:$E$44,4,FALSE),IF(F23=\"X\",VLOOKUP($C23,Detail!$B$4:$E$44,4,FALSE),IF(F23=\"S\",VLOOKUP($C23,Detail!$B$4:$E$44,4,FALSE),\"\")))))","v":""},{"$f":"IF(G23=\"P\",VLOOKUP($C23,Detail!$B$4:$E$44,4,FALSE),IF(G23=\"PC\",VLOOKUP($C23,Detail!$B$4:$E$44,4,FALSE),IF(G23=\"E\",VLOOKUP($C23,Detail!$B$4:$E$44,4,FALSE),IF(G23=\"X\",VLOOKUP($C23,Detail!$B$4:$E$44,4,FALSE),IF(G23=\"S\",VLOOKUP($C23,Detail!$B$4:$E$44,4,FALSE),\"\")))))","v":""},{"$f":"IF(H23=\"P\",VLOOKUP($C23,Detail!$B$4:$E$44,4,FALSE),IF(H23=\"PC\",VLOOKUP($C23,Detail!$B$4:$E$44,4,FALSE),IF(H23=\"E\",VLOOKUP($C23,Detail!$B$4:$E$44,4,FALSE),IF(H23=\"X\",VLOOKUP($C23,Detail!$B$4:$E$44,4,FALSE),IF(H23=\"S\",VLOOKUP($C23,Detail!$B$4:$E$44,4,FALSE),\"\")))))","v":""},{"$f":"IF(I23=\"P\",VLOOKUP($C23,Detail!$B$4:$E$44,4,FALSE),IF(I23=\"PC\",VLOOKUP($C23,Detail!$B$4:$E$44,4,FALSE),IF(I23=\"E\",VLOOKUP($C23,Detail!$B$4:$E$44,4,FALSE),IF(I23=\"X\",VLOOKUP($C23,Detail!$B$4:$E$44,4,FALSE),IF(I23=\"S\",VLOOKUP($C23,Detail!$B$4:$E$44,4,FALSE),\"\")))))","v":""},{"$f":"IF(J23=\"P\",VLOOKUP($C23,Detail!$B$4:$E$44,4,FALSE),IF(J23=\"PC\",VLOOKUP($C23,Detail!$B$4:$E$44,4,FALSE),IF(J23=\"E\",VLOOKUP($C23,Detail!$B$4:$E$44,4,FALSE),IF(J23=\"X\",VLOOKUP($C23,Detail!$B$4:$E$44,4,FALSE),IF(J23=\"S\",VLOOKUP($C23,Detail!$B$4:$E$44,4,FALSE),\"\")))))","v":""},{"$f":"IF(K23=\"P\",VLOOKUP($C23,Detail!$B$4:$E$44,4,FALSE),IF(K23=\"PC\",VLOOKUP($C23,Detail!$B$4:$E$44,4,FALSE),IF(K23=\"E\",VLOOKUP($C23,Detail!$B$4:$E$44,4,FALSE),IF(K23=\"X\",VLOOKUP($C23,Detail!$B$4:$E$44,4,FALSE),IF(K23=\"S\",VLOOKUP($C23,Detail!$B$4:$E$44,4,FALSE),\"\")))))","v":""},{"$f":"IF(L23=\"P\",VLOOKUP($C23,Detail!$B$4:$E$44,4,FALSE),IF(L23=\"PC\",VLOOKUP($C23,Detail!$B$4:$E$44,4,FALSE),IF(L23=\"E\",VLOOKUP($C23,Detail!$B$4:$E$44,4,FALSE),IF(L23=\"X\",VLOOKUP($C23,Detail!$B$4:$E$44,4,FALSE),IF(L23=\"S\",VLOOKUP($C23,Detail!$B$4:$E$44,4,FALSE),\"\")))))","v":""},{"$f":"IF(M23=\"P\",VLOOKUP($C23,Detail!$B$4:$E$44,4,FALSE),IF(M23=\"PC\",VLOOKUP($C23,Detail!$B$4:$E$44,4,FALSE),IF(M23=\"E\",VLOOKUP($C23,Detail!$B$4:$E$44,4,FALSE),IF(M23=\"X\",VLOOKUP($C23,Detail!$B$4:$E$44,4,FALSE),IF(M23=\"S\",VLOOKUP($C23,Detail!$B$4:$E$44,4,FALSE),\"\")))))","v":""},{"$f":"IF(N23=\"P\",VLOOKUP($C23,Detail!$B$4:$E$44,4,FALSE),IF(N23=\"PC\",VLOOKUP($C23,Detail!$B$4:$E$44,4,FALSE),IF(N23=\"E\",VLOOKUP($C23,Detail!$B$4:$E$44,4,FALSE),IF(N23=\"X\",VLOOKUP($C23,Detail!$B$4:$E$44,4,FALSE),IF(N23=\"S\",VLOOKUP($C23,Detail!$B$4:$E$44,4,FALSE),\"\")))))","v":""},{"$f":"IF(O23=\"P\",VLOOKUP($C23,Detail!$B$4:$E$44,4,FALSE),IF(O23=\"PC\",VLOOKUP($C23,Detail!$B$4:$E$44,4,FALSE),IF(O23=\"E\",VLOOKUP($C23,Detail!$B$4:$E$44,4,FALSE),IF(O23=\"X\",VLOOKUP($C23,Detail!$B$4:$E$44,4,FALSE),IF(O23=\"S\",VLOOKUP($C23,Detail!$B$4:$E$44,4,FALSE),\"\")))))","v":""}]
[null,null,{"$f":"IF(ISBLANK(Detail!B25),\"\",Detail!B25)","v":""},null,null,null,null,null,null,null,null,null,null,null,null,"","",null,null,null,null,null,"",{"$f":"IF(D24=\"P\",VLOOKUP($C24,Detail!$B$4:$E$44,4,FALSE),IF(D24=\"PC\",VLOOKUP($C24,Detail!$B$4:$E$44,4,FALSE),IF(D24=\"E\",VLOOKUP($C24,Detail!$B$4:$E$44,4,FALSE),IF(D24=\"X\",VLOOKUP($C24,Detail!$B$4:$E$44,4,FALSE),IF(D24=\"S\",VLOOKUP($C24,Detail!$B$4:$E$44,4,FALSE),\"\")))))","v":""},{"$f":"IF(E24=\"P\",VLOOKUP($C24,Detail!$B$4:$E$44,4,FALSE),IF(E24=\"PC\",VLOOKUP($C24,Detail!$B$4:$E$44,4,FALSE),IF(E24=\"E\",VLOOKUP($C24,Detail!$B$4:$E$44,4,FALSE),IF(E24=\"X\",VLOOKUP($C24,Detail!$B$4:$E$44,4,FALSE),IF(E24=\"S\",VLOOKUP($C24,Detail!$B$4:$E$44,4,FALSE),\"\")))))","v":""},{"$f":"IF(F24=\"P\",VLOOKUP($C24,Detail!$B$4:$E$44,4,FALSE),IF(F24=\"PC\",VLOOKUP($C24,Detail!$B$4:$E$44,4,FALSE),IF(F24=\"E\",VLOOKUP($C24,Detail!$B$4:$E$44,4,FALSE),IF(F24=\"X\",VLOOKUP($C24,Detail!$B$4:$E$44,4,FALSE),IF(F24=\"S\",VLOOKUP($C24,Detail!$B$4:$E$44,4,FALSE),\"\")))))","v":""},{"$f":"IF(G24=\"P\",VLOOKUP($C24,Detail!$B$4:$E$44,4,FALSE),IF(G24=\"PC\",VLOOKUP($C24,Detail!$B$4:$E$44,4,FALSE),IF(G24=\"E\",VLOOKUP($C24,Detail!$B$4:$E$44,4,FALSE),IF(G24=\"X\",VLOOKUP($C24,Detail!$B$4:$E$44,4,FALSE),IF(G24=\"S\",VLOOKUP($C24,Detail!$B$4:$E$44,4,FALSE),\"\")))))","v":""},{"$f":"IF(H24=\"P\",VLOOKUP($C24,Detail!$B$4:$E$44,4,FALSE),IF(H24=\"PC\",VLOOKUP($C24,Detail!$B$4:$E$44,4,FALSE),IF(H24=\"E\",VLOOKUP($C24,Detail!$B$4:$E$44,4,FALSE),IF(H24=\"X\",VLOOKUP($C24,Detail!$B$4:$E$44,4,FALSE),IF(H24=\"S\",VLOOKUP($C24,Detail!$B$4:$E$44,4,FALSE),\"\")))))","v":""},{"$f":"IF(I24=\"P\",VLOOKUP($C24,Detail!$B$4:$E$44,4,FALSE),IF(I24=\"PC\",VLOOKUP($C24,Detail!$B$4:$E$44,4,FALSE),IF(I24=\"E\",VLOOKUP($C24,Detail!$B$4:$E$44,4,FALSE),IF(I24=\"X\",VLOOKUP($C24,Detail!$B$4:$E$44,4,FALSE),IF(I24=\"S\",VLOOKUP($C24,Detail!$B$4:$E$44,4,FALSE),\"\")))))","v":""},{"$f":"IF(J24=\"P\",VLOOKUP($C24,Detail!$B$4:$E$44,4,FALSE),IF(J24=\"PC\",VLOOKUP($C24,Detail!$B$4:$E$44,4,FALSE),IF(J24=\"E\",VLOOKUP($C24,Detail!$B$4:$E$44,4,FALSE),IF(J24=\"X\",VLOOKUP($C24,Detail!$B$4:$E$44,4,FALSE),IF(J24=\"S\",VLOOKUP($C24,Detail!$B$4:$E$44,4,FALSE),\"\")))))","v":""},{"$f":"IF(K24=\"P\",VLOOKUP($C24,Detail!$B$4:$E$44,4,FALSE),IF(K24=\"PC\",VLOOKUP($C24,Detail!$B$4:$E$44,4,FALSE),IF(K24=\"E\",VLOOKUP($C24,Detail!$B$4:$E$44,4,FALSE),IF(K24=\"X\",VLOOKUP($C24,Detail!$B$4:$E$44,4,FALSE),IF(K24=\"S\",VLOOKUP($C24,Detail!$B$4:$E$44,4,FALSE),\"\")))))","v":""},{"$f":"IF(L24=\"P\",VLOOKUP($C24,Detail!$B$4:$E$44,4,FALSE),IF(L24=\"PC\",VLOOKUP($C24,Detail!$B$4:$E$44,4,FALSE),IF(L24=\"E\",VLOOKUP($C24,Detail!$B$4:$E$44,4,FALSE),IF(L24=\"X\",VLOOKUP($C24,Detail!$B$4:$E$44,4,FALSE),IF(L24=\"S\",VLOOKUP($C24,Detail!$B$4:$E$44,4,FALSE),\"\")))))","v":""},{"$f":"IF(M24=\"P\",VLOOKUP($C24,Detail!$B$4:$E$44,4,FALSE),IF(M24=\"PC\",VLOOKUP($C24,Detail!$B$4:$E$44,4,FALSE),IF(M24=\"E\",VLOOKUP($C24,Detail!$B$4:$E$44,4,FALSE),IF(M24=\"X\",VLOOKUP($C24,Detail!$B$4:$E$44,4,FALSE),IF(M24=\"S\",VLOOKUP($C24,Detail!$B$4:$E$44,4,FALSE),\"\")))))","v":""},{"$f":"IF(N24=\"P\",VLOOKUP($C24,Detail!$B$4:$E$44,4,FALSE),IF(N24=\"PC\",VLOOKUP($C24,Detail!$B$4:$E$44,4,FALSE),IF(N24=\"E\",VLOOKUP($C24,Detail!$B$4:$E$44,4,FALSE),IF(N24=\"X\",VLOOKUP($C24,Detail!$B$4:$E$44,4,FALSE),IF(N24=\"S\",VLOOKUP($C24,Detail!$B$4:$E$44,4,FALSE),\"\")))))","v":""},{"$f":"IF(O24=\"P\",VLOOKUP($C24,Detail!$B$4:$E$44,4,FALSE),IF(O24=\"PC\",VLOOKUP($C24,Detail!$B$4:$E$44,4,FALSE),IF(O24=\"E\",VLOOKUP($C24,Detail!$B$4:$E$44,4,FALSE),IF(O24=\"X\",VLOOKUP($C24,Detail!$B$4:$E$44,4,FALSE),IF(O24=\"S\",VLOOKUP($C24,Detail!$B$4:$E$44,4,FALSE),\"\")))))","v":""}]
[null,null,{"$f":"IF(ISBLANK(Detail!B26),\"\",Detail!B26)","v":""},null,null,null,null,null,null,null,null,null,null,null,null,"","",null,null,null,null,null,"",{"$f":"IF(D25=\"P\",VLOOKUP($C25,Detail!$B$4:$E$44,4,FALSE),IF(D25=\"PC\",VLOOKUP($C25,Detail!$B$4:$E$44,4,FALSE),IF(D25=\"E\",VLOOKUP($C25,Detail!$B$4:$E$44,4,FALSE),IF(D25=\"X\",VLOOKUP($C25,Detail!$B$4:$E$44,4,FALSE),IF(D25=\"S\",VLOOKUP($C25,Detail!$B$4:$E$44,4,FALSE),\"\")))))","v":""},{"$f":"IF(E25=\"P\",VLOOKUP($C25,Detail!$B$4:$E$44,4,FALSE),IF(E25=\"PC\",VLOOKUP($C25,Detail!$B$4:$E$44,4,FALSE),IF(E25=\"E\",VLOOKUP($C25,Detail!$B$4:$E$44,4,FALSE),IF(E25=\"X\",VLOOKUP($C25,Detail!$B$4:$E$44,4,FALSE),IF(E25=\"S\",VLOOKUP($C25,Detail!$B$4:$E$44,4,FALSE),\"\")))))","v":""},{"$f":"IF(F25=\"P\",VLOOKUP($C25,Detail!$B$4:$E$44,4,FALSE),IF(F25=\"PC\",VLOOKUP($C25,Detail!$B$4:$E$44,4,FALSE),IF(F25=\"E\",VLOOKUP($C25,Detail!$B$4:$E$44,4,FALSE),IF(F25=\"X\",VLOOKUP($C25,Detail!$B$4:$E$44,4,FALSE),IF(F25=\"S\",VLOOKUP($C25,Detail!$B$4:$E$44,4,FALSE),\"\")))))","v":""},{"$f":"IF(G25=\"P\",VLOOKUP($C25,Detail!$B$4:$E$44,4,FALSE),IF(G25=\"PC\",VLOOKUP($C25,Detail!$B$4:$E$44,4,FALSE),IF(G25=\"E\",VLOOKUP($C25,Detail!$B$4:$E$44,4,FALSE),IF(G25=\"X\",VLOOKUP($C25,Detail!$B$4:$E$44,4,FALSE),IF(G25=\"S\",VLOOKUP($C25,Detail!$B$4:$E$44,4,FALSE),\"\")))))","v":""},{"$f":"IF(H25=\"P\",VLOOKUP($C25,Detail!$B$4:$E$44,4,FALSE),IF(H25=\"PC\",VLOOKUP($C25,Detail!$B$4:$E$44,4,FALSE),IF(H25=\"E\",VLOOKUP($C25,Detail!$B$4:$E$44,4,FALSE),IF(H25=\"X\",VLOOKUP($C25,Detail!$B$4:$E$44,4,FALSE),IF(H25=\"S\",VLOOKUP($C25,Detail!$B$4:$E$44,4,FALSE),\"\")))))","v":""},{"$f":"IF(I25=\"P\",VLOOKUP($C25,Detail!$B$4:$E$44,4,FALSE),IF(I25=\"PC\",VLOOKUP($C25,Detail!$B$4:$E$44,4,FALSE),IF(I25=\"E\",VLOOKUP($C25,Detail!$B$4:$E$44,4,FALSE),IF(I25=\"X\",VLOOKUP($C25,Detail!$B$4:$E$44,4,FALSE),IF(I25=\"S\",VLOOKUP($C25,Detail!$B$4:$E$44,4,FALSE),\"\")))))","v":""},{"$f":"IF(J25=\"P\",VLOOKUP($C25,Detail!$B$4:$E$44,4,FALSE),IF(J25=\"PC\",VLOOKUP($C25,Detail!$B$4:$E$44,4,FALSE),IF(J25=\"E\",VLOOKUP($C25,Detail!$B$4:$E$44,4,FALSE),IF(J25=\"X\",VLOOKUP($C25,Detail!$B$4:$E$44,4,FALSE),IF(J25=\"S\",VLOOKUP($C25,Detail!$B$4:$E$44,4,FALSE),\"\")))))","v":""},{"$f":"IF(K25=\"P\",VLOOKUP($C25,Detail!$B$4:$E$44,4,FALSE),IF(K25=\"PC\",VLOOKUP($C25,Detail!$B$4:$E$44,4,FALSE),IF(K25=\"E\",VLOOKUP($C25,Detail!$B$4:$E$44,4,FALSE),IF(K25=\"X\",VLOOKUP($C25,Detail!$B$4:$E$44,4,FALSE),IF(K25=\"S\",VLOOKUP($C25,Detail!$B$4:$E$44,4,FALSE),\"\")))))","v":""},{"$f":"IF(L25=\"P\",VLOOKUP($C25,Detail!$B$4:$E$44,4,FALSE),IF(L25=\"PC\",VLOOKUP($C25,Detail!$B$4:$E$44,4,FALSE),IF(L25=\"E\",VLOOKUP($C25,Detail!$B$4:$E$44,4,FALSE),IF(L25=\"X\",VLOOKUP($C25,Detail!$B$4:$E$44,4,FALSE),IF(L25=\"S\",VLOOKUP($C25,Detail!$B$4:$E$44,4,FALSE),\"\")))))","v":""},{"$f":"IF(M25=\"P\",VLOOKUP($C25,Detail!$B$4:$E$44,4,FALSE),IF(M25=\"PC\",VLOOKUP($C25,Detail!$B$4:$E$44,4,FALSE),IF(M25=\"E\",VLOOKUP($C25,Detail!$B$4:$E$44,4,FALSE),IF(M25=\"X\",VLOOKUP($C25,Detail!$B$4:$E$44,4,FALSE),IF(M25=\"S\",VLOOKUP($C25,Detail!$B$4:$E$44,4,FALSE),\"\")))))","v":""},{"$f":"IF(N25=\"P\",VLOOKUP($C25,Detail!$B$4:$E$44,4,FALSE),IF(N25=\"PC\",VLOOKUP($C25,Detail!$B$4:$E$44,4,FALSE),IF(N25=\"E\",VLOOKUP($C25,Detail!$B$4:$E$44,4,FALSE),IF(N25=\"X\",VLOOKUP($C25,Detail!$B$4:$E$44,4,FALSE),IF(N25=\"S\",VLOOKUP($C25,Detail!$B$4:$E$44,4,FALSE),\"\")))))","v":""},{"$f":"IF(O25=\"P\",VLOOKUP($C25,Detail!$B$4:$E$44,4,FALSE),IF(O25=\"PC\",VLOOKUP($C25,Detail!$B$4:$E$44,4,FALSE),IF(O25=\"E\",VLOOKUP($C25,Detail!$B$4:$E$44,4,FALSE),IF(O25=\"X\",VLOOKUP($C25,Detail!$B$4:$E$44,4,FALSE),IF(O25=\"S\",VLOOKUP($C25,Detail!$B$4:$E$44,4,FALSE),\"\")))))","v":""}]
[null,null,{"$f":"IF(ISBLANK(Detail!B27),\"\",Detail!B27)","v":""},null,null,null,null,null,null,null,null,null,null,null,null,"","",null,null,null,null,null,""]
[null,null,{"$f":"IF(ISBLANK(Detail!B28),\"\",Detail!B28)","v":""},null,null,null,null,null,null,null,null,null,null,null,null,"","",null,null,null,null,null,""]
[null,null,{"$f":"IF(ISBLANK(Detail!B29),\"\",Detail!B29)","v":""},null,null,null,null,null,null,null,null,null,null,null,null,"","",null,null,null,null,null,""]
[null,null,{"$f":"IF(ISBLANK(Detail!B30),\"\",Detail!B30)","v":""},null,null,null,null,null,null,null,null,null,null,null,null,"","",null,null,null,null,null,""]
[null,null,{"$f":"IF(ISBLANK(Detail!B31),\"\",Detail!B31)","v":""},null,null,null,null,null,null,null,null,null,null,null,null,"","",null,null,null,null,null,""]
[null,null,{"$f":"IF(ISBLANK(Detail!B32),\"\",Detail!B32)","v":""},null,null,null,null,null,null,null,null,null,null,null,null,"","",null,null,null,null,null,""]
[null,null,{"$f":"IF(ISBLANK(Detail!B33),\"\",Detail!B33)","v":""},null,null,null,null,null,null,null,null,null,null,null,null,"","",null,null,null,null,null,""]
[null,null,{"$f":"IF(ISBLANK(Detail!B34),\"\",Detail!B34)","v":""},null,null,null,null,null,null,null,null,null,null,null,null,"","",null,null,null,null,null,""]
[null,null,{"$f":"IF(ISBLANK(Detail!B35),\"\",Detail!B35)","v":""},null,null,null,null,null,null,null,null,null,null,null,null,"","",null,null,null,null,null,""]
[null,null,{"$f":"IF(ISBLANK(Detail!B36),\"\",Detail!B36)","v":""},null,null,null,null,null,null,null,null,null,null,null,null,"","",null,null,null,null,null,""]
[null,null,{"$f":"IF(ISBLANK(Detail!B37),\"\",Detail!B37)","v":""},null,null,null,null,null,null,null,null,null,null,null,null,"","",null,null,null,null,null,"",{"$f":"IF(D36=\"P\",VLOOKUP($C36,Detail!$B$4:$E$44,4,FALSE),IF(D36=\"PC\",VLOOKUP($C36,Detail!$B$4:$E$44,4,FALSE),IF(D36=\"E\",VLOOKUP($C36,Detail!$B$4:$E$44,4,FALSE),IF(D36=\"X\",VLOOKUP($C36,Detail!$B$4:$E$44,4,FALSE),IF(D36=\"S\",VLOOKUP($C36,Detail!$B$4:$E$44,4,FALSE),\"\")))))","v":""},{"$f":"IF(E36=\"P\",VLOOKUP($C36,Detail!$B$4:$E$44,4,FALSE),IF(E36=\"PC\",VLOOKUP($C36,Detail!$B$4:$E$44,4,FALSE),IF(E36=\"E\",VLOOKUP($C36,Detail!$B$4:$E$44,4,FALSE),IF(E36=\"X\",VLOOKUP($C36,Detail!$B$4:$E$44,4,FALSE),IF(E36=\"S\",VLOOKUP($C36,Detail!$B$4:$E$44,4,FALSE),\"\")))))","v":""},{"$f":"IF(F36=\"P\",VLOOKUP($C36,Detail!$B$4:$E$44,4,FALSE),IF(F36=\"PC\",VLOOKUP($C36,Detail!$B$4:$E$44,4,FALSE),IF(F36=\"E\",VLOOKUP($C36,Detail!$B$4:$E$44,4,FALSE),IF(F36=\"X\",VLOOKUP($C36,Detail!$B$4:$E$44,4,FALSE),IF(F36=\"S\",VLOOKUP($C36,Detail!$B$4:$E$44,4,FALSE),\"\")))))","v":""},{"$f":"IF(G36=\"P\",VLOOKUP($C36,Detail!$B$4:$E$44,4,FALSE),IF(G36=\"PC\",VLOOKUP($C36,Detail!$B$4:$E$44,4,FALSE),IF(G36=\"E\",VLOOKUP($C36,Detail!$B$4:$E$44,4,FALSE),IF(G36=\"X\",VLOOKUP($C36,Detail!$B$4:$E$44,4,FALSE),IF(G36=\"S\",VLOOKUP($C36,Detail!$B$4:$E$44,4,FALSE),\"\")))))","v":""},{"$f":"IF(H36=\"P\",VLOOKUP($C36,Detail!$B$4:$E$44,4,FALSE),IF(H36=\"PC\",VLOOKUP($C36,Detail!$B$4:$E$44,4,FALSE),IF(H36=\"E\",VLOOKUP($C36,Detail!$B$4:$E$44,4,FALSE),IF(H36=\"X\",VLOOKUP($C36,Detail!$B$4:$E$44,4,FALSE),IF(H36=\"S\",VLOOKUP($C36,Detail!$B$4:$E$44,4,FALSE),\"\")))))","v":""},{"$f":"IF(I36=\"P\",VLOOKUP($C36,Detail!$B$4:$E$44,4,FALSE),IF(I36=\"PC\",VLOOKUP($C36,Detail!$B$4:$E$44,4,FALSE),IF(I36=\"E\",VLOOKUP($C36,Detail!$B$4:$E$44,4,FALSE),IF(I36=\"X\",VLOOKUP($C36,Detail!$B$4:$E$44,4,FALSE),IF(I36=\"S\",VLOOKUP($C36,Detail!$B$4:$E$44,4,FALSE),\"\")))))","v":""},{"$f":"IF(J36=\"P\",VLOOKUP($C36,Detail!$B$4:$E$44,4,FALSE),IF(J36=\"PC\",VLOOKUP($C36,Detail!$B$4:$E$44,4,FALSE),IF(J36=\"E\",VLOOKUP($C36,Detail!$B$4:$E$44,4,FALSE),IF(J36=\"X\",VLOOKUP($C36,Detail!$B$4:$E$44,4,FALSE),IF(J36=\"S\",VLOOKUP($C36,Detail!$B$4:$E$44,4,FALSE),\"\")))))","v":""},{"$f":"IF(K36=\"P\",VLOOKUP($C36,Detail!$B$4:$E$44,4,FALSE),IF(K36=\"PC\",VLOOKUP($C36,Detail!$B$4:$E$44,4,FALSE),IF(K36=\"E\",VLOOKUP($C36,Detail!$B$4:$E$44,4,FALSE),IF(K36=\"X\",VLOOKUP($C36,Detail!$B$4:$E$44,4,FALSE),IF(K36=\"S\",VLOOKUP($C36,Detail!$B$4:$E$44,4,FALSE),\"\")))))","v":""},{"$f":"IF(L36=\"P\",VLOOKUP($C36,Detail!$B$4:$E$44,4,FALSE),IF(L36=\"PC\",VLOOKUP($C36,Detail!$B$4:$E$44,4,FALSE),IF(L36=\"E\",VLOOKUP($C36,Detail!$B$4:$E$44,4,FALSE),IF(L36=\"X\",VLOOKUP($C36,Detail!$B$4:$E$44,4,FALSE),IF(L36=\"S\",VLOOKUP($C36,Detail!$B$4:$E$44,4,FALSE),\"\")))))","v":""},{"$f":"IF(M36=\"P\",VLOOKUP($C36,Detail!$B$4:$E$44,4,FALSE),IF(M36=\"PC\",VLOOKUP($C36,Detail!$B$4:$E$44,4,FALSE),IF(M36=\"E\",VLOOKUP($C36,Detail!$B$4:$E$44,4,FALSE),IF(M36=\"X\",VLOOKUP($C36,Detail!$B$4:$E$44,4,FALSE),IF(M36=\"S\",VLOOKUP($C36,Detail!$B$4:$E$44,4,FALSE),\"\")))))","v":""},{"$f":"IF(N36=\"P\",VLOOKUP($C36,Detail!$B$4:$E$44,4,FALSE),IF(N36=\"PC\",VLOOKUP($C36,Detail!$B$4:$E$44,4,FALSE),IF(N36=\"E\",VLOOKUP($C36,Detail!$B$4:$E$44,4,FALSE),IF(N36=\"X\",VLOOKUP($C36,Detail!$B$4:$E$44,4,FALSE),IF(N36=\"S\",VLOOKUP($C36,Detail!$B$4:$E$44,4,FALSE),\"\")))))","v":""},{"$f":"IF(O36=\"P\",VLOOKUP($C36,Detail!$B$4:$E$44,4,FALSE),IF(O36=\"PC\",VLOOKUP($C36,Detail!$B$4:$E$44,4,FALSE),IF(O36=\"E\",VLOOKUP($C36,Detail!$B$4:$E$44,4,FALSE),IF(O36=\"X\",VLOOKUP($C36,Detail!$B$4:$E$44,4,FALSE),IF(O36=\"S\",VLOOKUP($C36,Detail!$B$4:$E$44,4,FALSE),\"\")))))","v":""}]
[null,null,{"$f":"IF(ISBLANK(Detail!B38),\"\",Detail!B38)","v":""},null,null,null,null,null,null,null,null,null,null,null,null,"","",null,null,null,null,null,"",{"$f":"IF(D37=\"P\",VLOOKUP($C37,Detail!$B$4:$E$44,4,FALSE),IF(D37=\"PC\",VLOOKUP($C37,Detail!$B$4:$E$44,4,FALSE),IF(D37=\"E\",VLOOKUP($C37,Detail!$B$4:$E$44,4,FALSE),IF(D37=\"X\",VLOOKUP($C37,Detail!$B$4:$E$44,4,FALSE),IF(D37=\"S\",VLOOKUP($C37,Detail!$B$4:$E$44,4,FALSE),\"\")))))","v":""},{"$f":"IF(E37=\"P\",VLOOKUP($C37,Detail!$B$4:$E$44,4,FALSE),IF(E37=\"PC\",VLOOKUP($C37,Detail!$B$4:$E$44,4,FALSE),IF(E37=\"E\",VLOOKUP($C37,Detail!$B$4:$E$44,4,FALSE),IF(E37=\"X\",VLOOKUP($C37,Detail!$B$4:$E$44,4,FALSE),IF(E37=\"S\",VLOOKUP($C37,Detail!$B$4:$E$44,4,FALSE),\"\")))))","v":""},{"$f":"IF(F37=\"P\",VLOOKUP($C37,Detail!$B$4:$E$44,4,FALSE),IF(F37=\"PC\",VLOOKUP($C37,Detail!$B$4:$E$44,4,FALSE),IF(F37=\"E\",VLOOKUP($C37,Detail!$B$4:$E$44,4,FALSE),IF(F37=\"X\",VLOOKUP($C37,Detail!$B$4:$E$44,4,FALSE),IF(F37=\"S\",VLOOKUP($C37,Detail!$B$4:$E$44,4,FALSE),\"\")))))","v":""},{"$f":"IF(G37=\"P\",VLOOKUP($C37,Detail!$B$4:$E$44,4,FALSE),IF(G37=\"PC\",VLOOKUP($C37,Detail!$B$4:$E$44,4,FALSE),IF(G37=\"E\",VLOOKUP($C37,Detail!$B$4:$E$44,4,FALSE),IF(G37=\"X\",VLOOKUP($C37,Detail!$B$4:$E$44,4,FALSE),IF(G37=\"S\",VLOOKUP($C37,Detail!$B$4:$E$44,4,FALSE),\"\")))))","v":""},{"$f":"IF(H37=\"P\",VLOOKUP($C37,Detail!$B$4:$E$44,4,FALSE),IF(H37=\"PC\",VLOOKUP($C37,Detail!$B$4:$E$44,4,FALSE),IF(H37=\"E\",VLOOKUP($C37,Detail!$B$4:$E$44,4,FALSE),IF(H37=\"X\",VLOOKUP($C37,Detail!$B$4:$E$44,4,FALSE),IF(H37=\"S\",VLOOKUP($C37,Detail!$B$4:$E$44,4,FALSE),\"\")))))","v":""},{"$f":"IF(I37=\"P\",VLOOKUP($C37,Detail!$B$4:$E$44,4,FALSE),IF(I37=\"PC\",VLOOKUP($C37,Detail!$B$4:$E$44,4,FALSE),IF(I37=\"E\",VLOOKUP($C37,Detail!$B$4:$E$44,4,FALSE),IF(I37=\"X\",VLOOKUP($C37,Detail!$B$4:$E$44,4,FALSE),IF(I37=\"S\",VLOOKUP($C37,Detail!$B$4:$E$44,4,FALSE),\"\")))))","v":""},{"$f":"IF(J37=\"P\",VLOOKUP($C37,Detail!$B$4:$E$44,4,FALSE),IF(J37=\"PC\",VLOOKUP($C37,Detail!$B$4:$E$44,4,FALSE),IF(J37=\"E\",VLOOKUP($C37,Detail!$B$4:$E$44,4,FALSE),IF(J37=\"X\",VLOOKUP($C37,Detail!$B$4:$E$44,4,FALSE),IF(J37=\"S\",VLOOKUP($C37,Detail!$B$4:$E$44,4,FALSE),\"\")))))","v":""},{"$f":"IF(K37=\"P\",VLOOKUP($C37,Detail!$B$4:$E$44,4,FALSE),IF(K37=\"PC\",VLOOKUP($C37,Detail!$B$4:$E$44,4,FALSE),IF(K37=\"E\",VLOOKUP($C37,Detail!$B$4:$E$44,4,FALSE),IF(K37=\"X\",VLOOKUP($C37,Detail!$B$4:$E$44,4,FALSE),IF(K37=\"S\",VLOOKUP($C37,Detail!$B$4:$E$44,4,FALSE),\"\")))))","v":""},{"$f":"IF(L37=\"P\",VLOOKUP($C37,Detail!$B$4:$E$44,4,FALSE),IF(L37=\"PC\",VLOOKUP($C37,Detail!$B$4:$E$44,4,FALSE),IF(L37=\"E\",VLOOKUP($C37,Detail!$B$4:$E$44,4,FALSE),IF(L37=\"X\",VLOOKUP($C37,Detail!$B$4:$E$44,4,FALSE),IF(L37=\"S\",VLOOKUP($C37,Detail!$B$4:$E$44,4,FALSE),\"\")))))","v":""},{"$f":"IF(M37=\"P\",VLOOKUP($C37,Detail!$B$4:$E$44,4,FALSE),IF(M37=\"PC\",VLOOKUP($C37,Detail!$B$4:$E$44,4,FALSE),IF(M37=\"E\",VLOOKUP($C37,Detail!$B$4:$E$44,4,FALSE),IF(M37=\"X\",VLOOKUP($C37,Detail!$B$4:$E$44,4,FALSE),IF(M37=\"S\",VLOOKUP($C37,Detail!$B$4:$E$44,4,FALSE),\"\")))))","v":""},{"$f":"IF(N37=\"P\",VLOOKUP($C37,Detail!$B$4:$E$44,4,FALSE),IF(N37=\"PC\",VLOOKUP($C37,Detail!$B$4:$E$44,4,FALSE),IF(N37=\"E\",VLOOKUP($C37,Detail!$B$4:$E$44,4,FALSE),IF(N37=\"X\",VLOOKUP($C37,Detail!$B$4:$E$44,4,FALSE),IF(N37=\"S\",VLOOKUP($C37,Detail!$B$4:$E$44,4,FALSE),\"\")))))","v":""},{"$f":"IF(O37=\"P\",VLOOKUP($C37,Detail!$B$4:$E$44,4,FALSE),IF(O37=\"PC\",VLOOKUP($C37,Detail!$B$4:$E$44,4,FALSE),IF(O37=\"E\",VLOOKUP($C37,Detail!$B$4:$E$44,4,FALSE),IF(O37=\"X\",VLOOKUP($C37,Detail!$B$4:$E$44,4,FALSE),IF(O37=\"S\",VLOOKUP($C37,Detail!$B$4:$E$44,4,FALSE),\"\")))))","v":""}]
[null,null,{"$f":"IF(ISBLANK(Detail!B39),\"\",Detail!B39)","v":""},null,null,null,null,null,null,null,null,null,null,null,null,"","",null,null,null,null,null,"",{"$f":"IF(D38=\"P\",VLOOKUP($C38,Detail!$B$4:$E$44,4,FALSE),IF(D38=\"PC\",VLOOKUP($C38,Detail!$B$4:$E$44,4,FALSE),IF(D38=\"E\",VLOOKUP($C38,Detail!$B$4:$E$44,4,FALSE),IF(D38=\"X\",VLOOKUP($C38,Detail!$B$4:$E$44,4,FALSE),IF(D38=\"S\",VLOOKUP($C38,Detail!$B$4:$E$44,4,FALSE),\"\")))))","v":""},{"$f":"IF(E38=\"P\",VLOOKUP($C38,Detail!$B$4:$E$44,4,FALSE),IF(E38=\"PC\",VLOOKUP($C38,Detail!$B$4:$E$44,4,FALSE),IF(E38=\"E\",VLOOKUP($C38,Detail!$B$4:$E$44,4,FALSE),IF(E38=\"X\",VLOOKUP($C38,Detail!$B$4:$E$44,4,FALSE),IF(E38=\"S\",VLOOKUP($C38,Detail!$B$4:$E$44,4,FALSE),\"\")))))","v":""},{"$f":"IF(F38=\"P\",VLOOKUP($C38,Detail!$B$4:$E$44,4,FALSE),IF(F38=\"PC\",VLOOKUP($C38,Detail!$B$4:$E$44,4,FALSE),IF(F38=\"E\",VLOOKUP($C38,Detail!$B$4:$E$44,4,FALSE),IF(F38=\"X\",VLOOKUP($C38,Detail!$B$4:$E$44,4,FALSE),IF(F38=\"S\",VLOOKUP($C38,Detail!$B$4:$E$44,4,FALSE),\"\")))))","v":""},{"$f":"IF(G38=\"P\",VLOOKUP($C38,Detail!$B$4:$E$44,4,FALSE),IF(G38=\"PC\",VLOOKUP($C38,Detail!$B$4:$E$44,4,FALSE),IF(G38=\"E\",VLOOKUP($C38,Detail!$B$4:$E$44,4,FALSE),IF(G38=\"X\",VLOOKUP($C38,Detail!$B$4:$E$44,4,FALSE),IF(G38=\"S\",VLOOKUP($C38,Detail!$B$4:$E$44,4,FALSE),\"\")))))","v":""},{"$f":"IF(H38=\"P\",VLOOKUP($C38,Detail!$B$4:$E$44,4,FALSE),IF(H38=\"PC\",VLOOKUP($C38,Detail!$B$4:$E$44,4,FALSE),IF(H38=\"E\",VLOOKUP($C38,Detail!$B$4:$E$44,4,FALSE),IF(H38=\"X\",VLOOKUP($C38,Detail!$B$4:$E$44,4,FALSE),IF(H38=\"S\",VLOOKUP($C38,Detail!$B$4:$E$44,4,FALSE),\"\")))))","v":""},{"$f":"IF(I38=\"P\",VLOOKUP($C38,Detail!$B$4:$E$44,4,FALSE),IF(I38=\"PC\",VLOOKUP($C38,Detail!$B$4:$E$44,4,FALSE),IF(I38=\"E\",VLOOKUP($C38,Detail!$B$4:$E$44,4,FALSE),IF(I38=\"X\",VLOOKUP($C38,Detail!$B$4:$E$44,4,FALSE),IF(I38=\"S\",VLOOKUP($C38,Detail!$B$4:$E$44,4,FALSE),\"\")))))","v":""},{"$f":"IF(J38=\"P\",VLOOKUP($C38,Detail!$B$4:$E$44,4,FALSE),IF(J38=\"PC\",VLOOKUP($C38,Detail!$B$4:$E$44,4,FALSE),IF(J38=\"E\",VLOOKUP($C38,Detail!$B$4:$E$44,4,FALSE),IF(J38=\"X\",VLOOKUP($C38,Detail!$B$4:$E$44,4,FALSE),IF(J38=\"S\",VLOOKUP($C38,Detail!$B$4:$E$44,4,FALSE),\"\")))))","v":""},{"$f":"IF(K38=\"P\",VLOOKUP($C38,Detail!$B$4:$E$44,4,FALSE),IF(K38=\"PC\",VLOOKUP($C38,Detail!$B$4:$E$44,4,FALSE),IF(K38=\"E\",VLOOKUP($C38,Detail!$B$4:$E$44,4,FALSE),IF(K38=\"X\",VLOOKUP($C38,Detail!$B$4:$E$44,4,FALSE),IF(K38=\"S\",VLOOKUP($C38,Detail!$B$4:$E$44,4,FALSE),\"\")))))","v":""},{"$f":"IF(L38=\"P\",VLOOKUP($C38,Detail!$B$4:$E$44,4,FALSE),IF(L38=\"PC\",VLOOKUP($C38,Detail!$B$4:$E$44,4,FALSE),IF(L38=\"E\",VLOOKUP($C38,Detail!$B$4:$E$44,4,FALSE),IF(L38=\"X\",VLOOKUP($C38,Detail!$B$4:$E$44,4,FALSE),IF(L38=\"S\",VLOOKUP($C38,Detail!$B$4:$E$44,4,FALSE),\"\")))))","v":""},{"$f":"IF(M38=\"P\",VLOOKUP($C38,Detail!$B$4:$E$44,4,FALSE),IF(M38=\"PC\",VLOOKUP($C38,Detail!$B$4:$E$44,4,FALSE),IF(M38=\"E\",VLOOKUP($C38,Detail!$B$4:$E$44,4,FALSE),IF(M38=\"X\",VLOOKUP($C38,Detail!$B$4:$E$44,4,FALSE),IF(M38=\"S\",VLOOKUP($C38,Detail!$B$4:$E$44,4,FALSE),\"\")))))","v":""},{"$f":"IF(N38=\"P\",VLOOKUP($C38,Detail!$B$4:$E$44,4,FALSE),IF(N38=\"PC\",VLOOKUP($C38,Detail!$B$4:$E$44,4,FALSE),IF(N38=\"E\",VLOOKUP($C38,Detail!$B$4:$E$44,4,FALSE),IF(N38=\"X\",VLOOKUP($C38,Detail!$B$4:$E$44,4,FALSE),IF(N38=\"S\",VLOOKUP($C38,Detail!$B$4:$E$44,4,FALSE),\"\")))))","v":""},{"$f":"IF(O38=\"P\",VLOOKUP($C38,Detail!$B$4:$E$44,4,FALSE),IF(O38=\"PC\",VLOOKUP($C38,Detail!$B$4:$E$44,4,FALSE),IF(O38=\"E\",VLOOKUP($C38,Detail!$B$4:$E$44,4,FALSE),IF(O38=\"X\",VLOOKUP($C38,Detail!$B$4:$E$44,4,FALSE),IF(O38=\"S\",VLOOKUP($C38,Detail!$B$4:$E$44,4,FALSE),\"\")))))","v":""}]
[null,null,{"$f":"IF(ISBLANK(Detail!B40),\"\",Detail!B40)","v":""},null,null,null,null,null,null,null,null,null,null,null,null,"","",null,null,null,null,null,"",{"$f":"IF(D39=\"P\",VLOOKUP($C39,Detail!$B$4:$E$44,4,FALSE),IF(D39=\"PC\",VLOOKUP($C39,Detail!$B$4:$E$44,4,FALSE),IF(D39=\"E\",VLOOKUP($C39,Detail!$B$4:$E$44,4,FALSE),IF(D39=\"X\",VLOOKUP($C39,Detail!$B$4:$E$44,4,FALSE),IF(D39=\"S\",VLOOKUP($C39,Detail!$B$4:$E$44,4,FALSE),\"\")))))","v":""},{"$f":"IF(E39=\"P\",VLOOKUP($C39,Detail!$B$4:$E$44,4,FALSE),IF(E39=\"PC\",VLOOKUP($C39,Detail!$B$4:$E$44,4,FALSE),IF(E39=\"E\",VLOOKUP($C39,Detail!$B$4:$E$44,4,FALSE),IF(E39=\"X\",VLOOKUP($C39,Detail!$B$4:$E$44,4,FALSE),IF(E39=\"S\",VLOOKUP($C39,Detail!$B$4:$E$44,4,FALSE),\"\")))))","v":""},{"$f":"IF(F39=\"P\",VLOOKUP($C39,Detail!$B$4:$E$44,4,FALSE),IF(F39=\"PC\",VLOOKUP($C39,Detail!$B$4:$E$44,4,FALSE),IF(F39=\"E\",VLOOKUP($C39,Detail!$B$4:$E$44,4,FALSE),IF(F39=\"X\",VLOOKUP($C39,Detail!$B$4:$E$44,4,FALSE),IF(F39=\"S\",VLOOKUP($C39,Detail!$B$4:$E$44,4,FALSE),\"\")))))","v":""},{"$f":"IF(G39=\"P\",VLOOKUP($C39,Detail!$B$4:$E$44,4,FALSE),IF(G39=\"PC\",VLOOKUP($C39,Detail!$B$4:$E$44,4,FALSE),IF(G39=\"E\",VLOOKUP($C39,Detail!$B$4:$E$44,4,FALSE),IF(G39=\"X\",VLOOKUP($C39,Detail!$B$4:$E$44,4,FALSE),IF(G39=\"S\",VLOOKUP($C39,Detail!$B$4:$E$44,4,FALSE),\"\")))))","v":""},{"$f":"IF(H39=\"P\",VLOOKUP($C39,Detail!$B$4:$E$44,4,FALSE),IF(H39=\"PC\",VLOOKUP($C39,Detail!$B$4:$E$44,4,FALSE),IF(H39=\"E\",VLOOKUP($C39,Detail!$B$4:$E$44,4,FALSE),IF(H39=\"X\",VLOOKUP($C39,Detail!$B$4:$E$44,4,FALSE),IF(H39=\"S\",VLOOKUP($C39,Detail!$B$4:$E$44,4,FALSE),\"\")))))","v":""},{"$f":"IF(I39=\"P\",VLOOKUP($C39,Detail!$B$4:$E$44,4,FALSE),IF(I39=\"PC\",VLOOKUP($C39,Detail!$B$4:$E$44,4,FALSE),IF(I39=\"E\",VLOOKUP($C39,Detail!$B$4:$E$44,4,FALSE),IF(I39=\"X\",VLOOKUP($C39,Detail!$B$4:$E$44,4,FALSE),IF(I39=\"S\",VLOOKUP($C39,Detail!$B$4:$E$44,4,FALSE),\"\")))))","v":""},{"$f":"IF(J39=\"P\",VLOOKUP($C39,Detail!$B$4:$E$44,4,FALSE),IF(J39=\"PC\",VLOOKUP($C39,Detail!$B$4:$E$44,4,FALSE),IF(J39=\"E\",VLOOKUP($C39,Detail!$B$4:$E$44,4,FALSE),IF(J39=\"X\",VLOOKUP($C39,Detail!$B$4:$E$44,4,FALSE),IF(J39=\"S\",VLOOKUP($C39,Detail!$B$4:$E$44,4,FALSE),\"\")))))","v":""},{"$f":"IF(K39=\"P\",VLOOKUP($C39,Detail!$B$4:$E$44,4,FALSE),IF(K39=\"PC\",VLOOKUP($C39,Detail!$B$4:$E$44,4,FALSE),IF(K39=\"E\",VLOOKUP($C39,Detail!$B$4:$E$44,4,FALSE),IF(K39=\"X\",VLOOKUP($C39,Detail!$B$4:$E$44,4,FALSE),IF(K39=\"S\",VLOOKUP($C39,Detail!$B$4:$E$44,4,FALSE),\"\")))))","v":""},{"$f":"IF(L39=\"P\",VLOOKUP($C39,Detail!$B$4:$E$44,4,FALSE),IF(L39=\"PC\",VLOOKUP($C39,Detail!$B$4:$E$44,4,FALSE),IF(L39=\"E\",VLOOKUP($C39,Detail!$B$4:$E$44,4,FALSE),IF(L39=\"X\",VLOOKUP($C39,Detail!$B$4:$E$44,4,FALSE),IF(L39=\"S\",VLOOKUP($C39,Detail!$B$4:$E$44,4,FALSE),\"\")))))","v":""},{"$f":"IF(M39=\"P\",VLOOKUP($C39,Detail!$B$4:$E$44,4,FALSE),IF(M39=\"PC\",VLOOKUP($C39,Detail!$B$4:$E$44,4,FALSE),IF(M39=\"E\",VLOOKUP($C39,Detail!$B$4:$E$44,4,FALSE),IF(M39=\"X\",VLOOKUP($C39,Detail!$B$4:$E$44,4,FALSE),IF(M39=\"S\",VLOOKUP($C39,Detail!$B$4:$E$44,4,FALSE),\"\")))))","v":""},{"$f":"IF(N39=\"P\",VLOOKUP($C39,Detail!$B$4:$E$44,4,FALSE),IF(N39=\"PC\",VLOOKUP($C39,Detail!$B$4:$E$44,4,FALSE),IF(N39=\"E\",VLOOKUP($C39,Detail!$B$4:$E$44,4,FALSE),IF(N39=\"X\",VLOOKUP($C39,Detail!$B$4:$E$44,4,FALSE),IF(N39=\"S\",VLOOKUP($C39,Detail!$B$4:$E$44,4,FALSE),\"\")))))","v":""},{"$f":"IF(O39=\"P\",VLOOKUP($C39,Detail!$B$4:$E$44,4,FALSE),IF(O39=\"PC\",VLOOKUP($C39,Detail!$B$4:$E$44,4,FALSE),IF(O39=\"E\",VLOOKUP($C39,Detail!$B$4:$E$44,4,FALSE),IF(O39=\"X\",VLOOKUP($C39,Detail!$B$4:$E$44,4,FALSE),IF(O39=\"S\",VLOOKUP($C39,Detail!$B$4:$E$44,4,FALSE),\"\")))))","v":""}]
[null,null,{"$f":"IF(ISBLANK(Detail!B41),\"\",Detail!B41)","v":""},null,null,null,null,null,null,null,null,null,null,null,null,"","",null,null,null,null,null,""]
[null,null,{"$f":"IF(ISBLANK(Detail!B42),\"\",Detail!B42)","v":""},null,null,null,null,null,null,null,null,null,null,null,null,"","",null,null,null,null,null,""]
[null,null,{"$f":"IF(ISBLANK(Detail!B43),\"\",Detail!B43)","v":""},null,null,null,null,null,null,null,null,null,null,null,null,"","",null,null,null,null,null,"",{"$f":"IF(D42=\"P\",VLOOKUP($C42,Detail!$B$4:$E$44,4,FALSE),IF(D42=\"PC\",VLOOKUP($C42,Detail!$B$4:$E$44,4,FALSE),IF(D42=\"E\",VLOOKUP($C42,Detail!$B$4:$E$44,4,FALSE),IF(D42=\"X\",VLOOKUP($C42,Detail!$B$4:$E$44,4,FALSE),IF(D42=\"S\",VLOOKUP($C42,Detail!$B$4:$E$44,4,FALSE),\"\")))))","v":""},{"$f":"IF(E42=\"P\",VLOOKUP($C42,Detail!$B$4:$E$44,4,FALSE),IF(E42=\"PC\",VLOOKUP($C42,Detail!$B$4:$E$44,4,FALSE),IF(E42=\"E\",VLOOKUP($C42,Detail!$B$4:$E$44,4,FALSE),IF(E42=\"X\",VLOOKUP($C42,Detail!$B$4:$E$44,4,FALSE),IF(E42=\"S\",VLOOKUP($C42,Detail!$B$4:$E$44,4,FALSE),\"\")))))","v":""},{"$f":"IF(F42=\"P\",VLOOKUP($C42,Detail!$B$4:$E$44,4,FALSE),IF(F42=\"PC\",VLOOKUP($C42,Detail!$B$4:$E$44,4,FALSE),IF(F42=\"E\",VLOOKUP($C42,Detail!$B$4:$E$44,4,FALSE),IF(F42=\"X\",VLOOKUP($C42,Detail!$B$4:$E$44,4,FALSE),IF(F42=\"S\",VLOOKUP($C42,Detail!$B$4:$E$44,4,FALSE),\"\")))))","v":""},{"$f":"IF(G42=\"P\",VLOOKUP($C42,Detail!$B$4:$E$44,4,FALSE),IF(G42=\"PC\",VLOOKUP($C42,Detail!$B$4:$E$44,4,FALSE),IF(G42=\"E\",VLOOKUP($C42,Detail!$B$4:$E$44,4,FALSE),IF(G42=\"X\",VLOOKUP($C42,Detail!$B$4:$E$44,4,FALSE),IF(G42=\"S\",VLOOKUP($C42,Detail!$B$4:$E$44,4,FALSE),\"\")))))","v":""},{"$f":"IF(H42=\"P\",VLOOKUP($C42,Detail!$B$4:$E$44,4,FALSE),IF(H42=\"PC\",VLOOKUP($C42,Detail!$B$4:$E$44,4,FALSE),IF(H42=\"E\",VLOOKUP($C42,Detail!$B$4:$E$44,4,FALSE),IF(H42=\"X\",VLOOKUP($C42,Detail!$B$4:$E$44,4,FALSE),IF(H42=\"S\",VLOOKUP($C42,Detail!$B$4:$E$44,4,FALSE),\"\")))))","v":""},{"$f":"IF(I42=\"P\",VLOOKUP($C42,Detail!$B$4:$E$44,4,FALSE),IF(I42=\"PC\",VLOOKUP($C42,Detail!$B$4:$E$44,4,FALSE),IF(I42=\"E\",VLOOKUP($C42,Detail!$B$4:$E$44,4,FALSE),IF(I42=\"X\",VLOOKUP($C42,Detail!$B$4:$E$44,4,FALSE),IF(I42=\"S\",VLOOKUP($C42,Detail!$B$4:$E$44,4,FALSE),\"\")))))","v":""},{"$f":"IF(J42=\"P\",VLOOKUP($C42,Detail!$B$4:$E$44,4,FALSE),IF(J42=\"PC\",VLOOKUP($C42,Detail!$B$4:$E$44,4,FALSE),IF(J42=\"E\",VLOOKUP($C42,Detail!$B$4:$E$44,4,FALSE),IF(J42=\"X\",VLOOKUP($C42,Detail!$B$4:$E$44,4,FALSE),IF(J42=\"S\",VLOOKUP($C42,Detail!$B$4:$E$44,4,FALSE),\"\")))))","v":""},{"$f":"IF(K42=\"P\",VLOOKUP($C42,Detail!$B$4:$E$44,4,FALSE),IF(K42=\"PC\",VLOOKUP($C42,Detail!$B$4:$E$44,4,FALSE),IF(K42=\"E\",VLOOKUP($C42,Detail!$B$4:$E$44,4,FALSE),IF(K42=\"X\",VLOOKUP($C42,Detail!$B$4:$E$44,4,FALSE),IF(K42=\"S\",VLOOKUP($C42,Detail!$B$4:$E$44,4,FALSE),\"\")))))","v":""},{"$f":"IF(L42=\"P\",VLOOKUP($C42,Detail!$B$4:$E$44,4,FALSE),IF(L42=\"PC\",VLOOKUP($C42,Detail!$B$4:$E$44,4,FALSE),IF(L42=\"E\",VLOOKUP($C42,Detail!$B$4:$E$44,4,FALSE),IF(L42=\"X\",VLOOKUP($C42,Detail!$B$4:$E$44,4,FALSE),IF(L42=\"S\",VLOOKUP($C42,Detail!$B$4:$E$44,4,FALSE),\"\")))))","v":""},{"$f":"IF(M42=\"P\",VLOOKUP($C42,Detail!$B$4:$E$44,4,FALSE),IF(M42=\"PC\",VLOOKUP($C42,Detail!$B$4:$E$44,4,FALSE),IF(M42=\"E\",VLOOKUP($C42,Detail!$B$4:$E$44,4,FALSE),IF(M42=\"X\",VLOOKUP($C42,Detail!$B$4:$E$44,4,FALSE),IF(M42=\"S\",VLOOKUP($C42,Detail!$B$4:$E$44,4,FALSE),\"\")))))","v":""},{"$f":"IF(N42=\"P\",VLOOKUP($C42,Detail!$B$4:$E$44,4,FALSE),IF(N42=\"PC\",VLOOKUP($C42,Detail!$B$4:$E$44,4,FALSE),IF(N42=\"E\",VLOOKUP($C42,Detail!$B$4:$E$44,4,FALSE),IF(N42=\"X\",VLOOKUP($C42,Detail!$B$4:$E$44,4,FALSE),IF(N42=\"S\",VLOOKUP($C42,Detail!$B$4:$E$44,4,FALSE),\"\")))))","v":""},{"$f":"IF(O42=\"P\",VLOOKUP($C42,Detail!$B$4:$E$44,4,FALSE),IF(O42=\"PC\",VLOOKUP($C42,Detail!$B$4:$E$44,4,FALSE),IF(O42=\"E\",VLOOKUP($C42,Detail!$B$4:$E$44,4,FALSE),IF(O42=\"X\",VLOOKUP($C42,Detail!$B$4:$E$44,4,FALSE),IF(O42=\"S\",VLOOKUP($C42,Detail!$B$4:$E$44,4,FALSE),\"\")))))","v":""}]
[null,null,{"$f":"IF(ISBLANK(Detail!B44),\"\",Detail!B44)","v":""},null,null,null,null,null,null,null,null,null,null,null,null,"","",null,null,null,null,null,"",{"$f":"IF(D43=\"P\",VLOOKUP($C43,Detail!$B$4:$E$44,4,FALSE),IF(D43=\"PC\",VLOOKUP($C43,Detail!$B$4:$E$44,4,FALSE),IF(D43=\"E\",VLOOKUP($C43,Detail!$B$4:$E$44,4,FALSE),IF(D43=\"X\",VLOOKUP($C43,Detail!$B$4:$E$44,4,FALSE),IF(D43=\"S\",VLOOKUP($C43,Detail!$B$4:$E$44,4,FALSE),\"\")))))","v":""},{"$f":"IF(E43=\"P\",VLOOKUP($C43,Detail!$B$4:$E$44,4,FALSE),IF(E43=\"PC\",VLOOKUP($C43,Detail!$B$4:$E$44,4,FALSE),IF(E43=\"E\",VLOOKUP($C43,Detail!$B$4:$E$44,4,FALSE),IF(E43=\"X\",VLOOKUP($C43,Detail!$B$4:$E$44,4,FALSE),IF(E43=\"S\",VLOOKUP($C43,Detail!$B$4:$E$44,4,FALSE),\"\")))))","v":""},{"$f":"IF(F43=\"P\",VLOOKUP($C43,Detail!$B$4:$E$44,4,FALSE),IF(F43=\"PC\",VLOOKUP($C43,Detail!$B$4:$E$44,4,FALSE),IF(F43=\"E\",VLOOKUP($C43,Detail!$B$4:$E$44,4,FALSE),IF(F43=\"X\",VLOOKUP($C43,Detail!$B$4:$E$44,4,FALSE),IF(F43=\"S\",VLOOKUP($C43,Detail!$B$4:$E$44,4,FALSE),\"\")))))","v":""},{"$f":"IF(G43=\"P\",VLOOKUP($C43,Detail!$B$4:$E$44,4,FALSE),IF(G43=\"PC\",VLOOKUP($C43,Detail!$B$4:$E$44,4,FALSE),IF(G43=\"E\",VLOOKUP($C43,Detail!$B$4:$E$44,4,FALSE),IF(G43=\"X\",VLOOKUP($C43,Detail!$B$4:$E$44,4,FALSE),IF(G43=\"S\",VLOOKUP($C43,Detail!$B$4:$E$44,4,FALSE),\"\")))))","v":""},{"$f":"IF(H43=\"P\",VLOOKUP($C43,Detail!$B$4:$E$44,4,FALSE),IF(H43=\"PC\",VLOOKUP($C43,Detail!$B$4:$E$44,4,FALSE),IF(H43=\"E\",VLOOKUP($C43,Detail!$B$4:$E$44,4,FALSE),IF(H43=\"X\",VLOOKUP($C43,Detail!$B$4:$E$44,4,FALSE),IF(H43=\"S\",VLOOKUP($C43,Detail!$B$4:$E$44,4,FALSE),\"\")))))","v":""},{"$f":"IF(I43=\"P\",VLOOKUP($C43,Detail!$B$4:$E$44,4,FALSE),IF(I43=\"PC\",VLOOKUP($C43,Detail!$B$4:$E$44,4,FALSE),IF(I43=\"E\",VLOOKUP($C43,Detail!$B$4:$E$44,4,FALSE),IF(I43=\"X\",VLOOKUP($C43,Detail!$B$4:$E$44,4,FALSE),IF(I43=\"S\",VLOOKUP($C43,Detail!$B$4:$E$44,4,FALSE),\"\")))))","v":""},{"$f":"IF(J43=\"P\",VLOOKUP($C43,Detail!$B$4:$E$44,4,FALSE),IF(J43=\"PC\",VLOOKUP($C43,Detail!$B$4:$E$44,4,FALSE),IF(J43=\"E\",VLOOKUP($C43,Detail!$B$4:$E$44,4,FALSE),IF(J43=\"X\",VLOOKUP($C43,Detail!$B$4:$E$44,4,FALSE),IF(J43=\"S\",VLOOKUP($C43,Detail!$B$4:$E$44,4,FALSE),\"\")))))","v":""},{"$f":"IF(K43=\"P\",VLOOKUP($C43,Detail!$B$4:$E$44,4,FALSE),IF(K43=\"PC\",VLOOKUP($C43,Detail!$B$4:$E$44,4,FALSE),IF(K43=\"E\",VLOOKUP($C43,Detail!$B$4:$E$44,4,FALSE),IF(K43=\"X\",VLOOKUP($C43,Detail!$B$4:$E$44,4,FALSE),IF(K43=\"S\",VLOOKUP($C43,Detail!$B$4:$E$44,4,FALSE),\"\")))))","v":""},{"$f":"IF(L43=\"P\",VLOOKUP($C43,Detail!$B$4:$E$44,4,FALSE),IF(L43=\"PC\",VLOOKUP($C43,Detail!$B$4:$E$44,4,FALSE),IF(L43=\"E\",VLOOKUP($C43,Detail!$B$4:$E$44,4,FALSE),IF(L43=\"X\",VLOOKUP($C43,Detail!$B$4:$E$44,4,FALSE),IF(L43=\"S\",VLOOKUP($C43,Detail!$B$4:$E$44,4,FALSE),\"\")))))","v":""},{"$f":"IF(M43=\"P\",VLOOKUP($C43,Detail!$B$4:$E$44,4,FALSE),IF(M43=\"PC\",VLOOKUP($C43,Detail!$B$4:$E$44,4,FALSE),IF(M43=\"E\",VLOOKUP($C43,Detail!$B$4:$E$44,4,FALSE),IF(M43=\"X\",VLOOKUP($C43,Detail!$B$4:$E$44,4,FALSE),IF(M43=\"S\",VLOOKUP($C43,Detail!$B$4:$E$44,4,FALSE),\"\")))))","v":""},{"$f":"IF(N43=\"P\",VLOOKUP($C43,Detail!$B$4:$E$44,4,FALSE),IF(N43=\"PC\",VLOOKUP($C43,Detail!$B$4:$E$44,4,FALSE),IF(N43=\"E\",VLOOKUP($C43,Detail!$B$4:$E$44,4,FALSE),IF(N43=\"X\",VLOOKUP($C43,Detail!$B$4:$E$44,4,FALSE),IF(N43=\"S\",VLOOKUP($C43,Detail!$B$4:$E$44,4,FALSE),\"\")))))","v":""},{"$f":"IF(O43=\"P\",VLOOKUP($C43,Detail!$B$4:$E$44,4,FALSE),IF(O43=\"PC\",VLOOKUP($C43,Detail!$B$4:$E$44,4,FALSE),IF(O43=\"E\",VLOOKUP($C43,Detail!$B$4:$E$44,4,FALSE),IF(O43=\"X\",VLOOKUP($C43,Detail!$B$4:$E$44,4,FALSE),IF(O43=\"S\",VLOOKUP($C43,Detail!$B$4:$E$44,4,FALSE),\"\")))))","v":""}]
[null,null,null,null,null,null,null,null,null,null,null,null,null,null,null,null,null,null,null,null,null,null,null,{"$f":"IF(D44=\"P\",VLOOKUP($C44,Detail!$B$4:$E$44,4,FALSE), IF(D44=\"PC\",VLOOKUP($C44,Detail!$B$4:$E$44,4,FALSE),\"\"))","v":""},{"$f":"IF(E44=\"P\",VLOOKUP($C44,Detail!$B$4:$E$44,4,FALSE), IF(E44=\"PC\",VLOOKUP($C44,Detail!$B$4:$E$44,4,FALSE),\"\"))","v":""},{"$f":"IF(F44=\"P\",VLOOKUP($C44,Detail!$B$4:$E$44,4,FALSE), IF(F44=\"PC\",VLOOKUP($C44,Detail!$B$4:$E$44,4,FALSE),\"\"))","v":""},{"$f":"IF(G44=\"P\",VLOOKUP($C44,Detail!$B$4:$E$44,4,FALSE), IF(G44=\"PC\",VLOOKUP($C44,Detail!$B$4:$E$44,4,FALSE),\"\"))","v":""},{"$f":"IF(H44=\"P\",VLOOKUP($C44,Detail!$B$4:$E$44,4,FALSE), IF(H44=\"PC\",VLOOKUP($C44,Detail!$B$4:$E$44,4,FALSE),\"\"))","v":""},{"$f":"IF(I44=\"P\",VLOOKUP($C44,Detail!$B$4:$E$44,4,FALSE), IF(I44=\"PC\",VLOOKUP($C44,Detail!$B$4:$E$44,4,FALSE),\"\"))","v":""},{"$f":"IF(J44=\"P\",VLOOKUP($C44,Detail!$B$4:$E$44,4,FALSE), IF(J44=\"PC\",VLOOKUP($C44,Detail!$B$4:$E$44,4,FALSE),\"\"))","v":""},{"$f":"IF(K44=\"P\",VLOOKUP($C44,Detail!$B$4:$E$44,4,FALSE), IF(K44=\"PC\",VLOOKUP($C44,Detail!$B$4:$E$44,4,FALSE),\"\"))","v":""},{"$f":"IF(L44=\"P\",VLOOKUP($C44,Detail!$B$4:$E$44,4,FALSE), IF(L44=\"PC\",VLOOKUP($C44,Detail!$B$4:$E$44,4,FALSE),\"\"))","v":""},{"$f":"IF(M44=\"P\",VLOOKUP($C44,Detail!$B$4:$E$44,4,FALSE), IF(M44=\"PC\",VLOOKUP($C44,Detail!$B$4:$E$44,4,FALSE),\"\"))","v":""},{"$f":"IF(N44=\"P\",VLOOKUP($C44,Detail!$B$4:$E$44,4,FALSE), IF(N44=\"PC\",VLOOKUP($C44,Detail!$B$4:$E$44,4,FALSE),\"\"))","v":""},{"$f":"IF(O44=\"P\",VLOOKUP($C44,Detail!$B$4:$E$44,4,FALSE), IF(O44=\"PC\",VLOOKUP($C44,Detail!$B$4:$E$44,4,FALSE),\"\"))","v":""}]
[null,"TOTAL ACTIVE BOARD MEMBERS",null,{"$f":"IF(D3=\"Enter Date\",\"\",COUNTIFS(D4:D43,\"P\")+COUNTIFS(D4:D43,\"PC\")+COUNTIFS(D4:D43,\"E\")+COUNTIFS(D4:D43,\"X\")+COUNTIFS(D4:D43,\"S\"))","v":""},{"$f":"IF(E3=\"Enter Date\",\"\",COUNTIFS(E4:E43,\"P\")+COUNTIFS(E4:E43,\"PC\")+COUNTIFS(E4:E43,\"E\")+COUNTIFS(E4:E43,\"X\")+COUNTIFS(E4:E43,\"S\"))","v":""},{"$f":"IF(F3=\"Enter Date\",\"\",COUNTIFS(F4:F43,\"P\")+COUNTIFS(F4:F43,\"PC\")+COUNTIFS(F4:F43,\"E\")+COUNTIFS(F4:F43,\"X\")+COUNTIFS(F4:F43,\"S\"))","v":""},{"$f":"IF(G3=\"Enter Date\",\"\",COUNTIFS(G4:G43,\"P\")+COUNTIFS(G4:G43,\"PC\")+COUNTIFS(G4:G43,\"E\")+COUNTIFS(G4:G43,\"X\")+COUNTIFS(G4:G43,\"S\"))","v":""},{"$f":"IF(H3=\"Enter Date\",\"\",COUNTIFS(H4:H43,\"P\")+COUNTIFS(H4:H43,\"PC\")+COUNTIFS(H4:H43,\"E\")+COUNTIFS(H4:H43,\"X\")+COUNTIFS(H4:H43,\"S\"))","v":""},{"$f":"IF(I3=\"Enter Date\",\"\",COUNTIFS(I4:I43,\"P\")+COUNTIFS(I4:I43,\"PC\")+COUNTIFS(I4:I43,\"E\")+COUNTIFS(I4:I43,\"X\")+COUNTIFS(I4:I43,\"S\"))","v":""},{"$f":"IF(J3=\"Enter Date\",\"\",COUNTIFS(J4:J43,\"P\")+COUNTIFS(J4:J43,\"PC\")+COUNTIFS(J4:J43,\"E\")+COUNTIFS(J4:J43,\"X\")+COUNTIFS(J4:J43,\"S\"))","v":""},{"$f":"IF(K3=\"Enter Date\",\"\",COUNTIFS(K4:K43,\"P\")+COUNTIFS(K4:K43,\"PC\")+COUNTIFS(K4:K43,\"E\")+COUNTIFS(K4:K43,\"X\")+COUNTIFS(K4:K43,\"S\"))","v":""},{"$f":"IF(L3=\"Enter Date\",\"\",COUNTIFS(L4:L43,\"P\")+COUNTIFS(L4:L43,\"PC\")+COUNTIFS(L4:L43,\"E\")+COUNTIFS(L4:L43,\"X\")+COUNTIFS(L4:L43,\"S\"))","v":""},{"$f":"IF(M3=\"Enter Date\",\"\",COUNTIFS(M4:M43,\"P\")+COUNTIFS(M4:M43,\"PC\")+COUNTIFS(M4:M43,\"E\")+COUNTIFS(M4:M43,\"X\")+COUNTIFS(M4:M43,\"S\"))","v":""},{"$f":"IF(N3=\"Enter Date\",\"\",COUNTIFS(N4:N43,\"P\")+COUNTIFS(N4:N43,\"PC\")+COUNTIFS(N4:N43,\"E\")+COUNTIFS(N4:N43,\"X\")+COUNTIFS(N4:N43,\"S\"))","v":""},{"$f":"IF(O3=\"Enter Date\",\"\",COUNTIFS(O4:O43,\"P\")+COUNTIFS(O4:O43,\"PC\")+COUNTIFS(O4:O43,\"E\")+COUNTIFS(O4:O43,\"X\")+COUNTIFS(O4:O43,\"S\"))","v":""}]
[null,"COMMUNITY ATTENDANCE",null,{"$f":"IF(D45=\"\",\"\",COUNTIF(X$4:X$44, \"C\"))","v":""},{"$f":"IF(E45=\"\",\"\",COUNTIF(Y$4:Y$44, \"C\"))","v":""},{"$f":"IF(F45=\"\",\"\",COUNTIF(Z$4:Z$44, \"C\"))","v":""},{"$f":"IF(G45=\"\",\"\",COUNTIF(AA$4:AA$44, \"C\"))","v":""},{"$f":"IF(H45=\"\",\"\",COUNTIF(AB$4:AB$44, \"C\"))","v":""},{"$f":"IF(I45=\"\",\"\",COUNTIF(AC$4:AC$44, \"C\"))","v":""},{"$f":"IF(J45=\"\",\"\",COUNTIF(AD$4:AD$44, \"C\"))","v":""},{"$f":"IF(K45=\"\",\"\",COUNTIF(AE$4:AE$44, \"C\"))","v":""},{"$f":"IF(L45=\"\",\"\",COUNTIF(AF$4:AF$44, \"C\"))","v":""},{"$f":"IF(M45=\"\",\"\",COUNTIF(AG$4:AG$44, \"C\"))","v":""},{"$f":"IF(N45=\"\",\"\",COUNTIF(AH$4:AH$44, \"C\"))","v":""},{"$f":"IF(O45=\"\",\"\",COUNTIF(AI$4:AI$44, \"C\"))","v":""}]
[null,"LOW-INCOME ATTENDANCE",null,{"$f":"IF(D45=\"\",\"\",COUNTIF(X$4:X$44, \"L\"))","v":""},{"$f":"IF(E45=\"\",\"\",COUNTIF(Y$4:Y$44, \"L\"))","v":""},{"$f":"IF(F45=\"\",\"\",COUNTIF(Z$4:Z$44, \"L\"))","v":""},{"$f":"IF(G45=\"\",\"\",COUNTIF(AA$4:AA$44, \"L\"))","v":""},{"$f":"IF(H45=\"\",\"\",COUNTIF(AB$4:AB$44, \"L\"))","v":""},{"$f":"IF(I45=\"\",\"\",COUNTIF(AC$4:AC$44, \"L\"))","v":""},{"$f":"IF(J45=\"\",\"\",COUNTIF(AD$4:AD$44, \"L\"))","v":""},{"$f":"IF(K45=\"\",\"\",COUNTIF(AE$4:AE$44, \"L\"))","v":""},{"$f":"IF(L45=\"\",\"\",COUNTIF(AF$4:AF$44, \"L\"))","v":""},{"$f":"IF(M45=\"\",\"\",COUNTIF(AG$4:AG$44, \"L\"))","v":""},{"$f":"IF(N45=\"\",\"\",COUNTIF(AH$4:AH$44, \"L\"))","v":""},{"$f":"IF(O45=\"\",\"\",COUNTIF(AI$4:AI$44, \"L\"))","v":""}]
[null,"PUBLIC ATTENDANCE",null,{"$f":"IF(D45=\"\",\"\",COUNTIF(X$4:X$44, \"P\"))","v":""},{"$f":"IF(E45=\"\",\"\",COUNTIF(Y$4:Y$44, \"P\"))","v":""},{"$f":"IF(F45=\"\",\"\",COUNTIF(Z$4:Z$44, \"P\"))","v":""},{"$f":"IF(G45=\"\",\"\",COUNTIF(AA$4:AA$44, \"P\"))","v":""},{"$f":"IF(H45=\"\",\"\",COUNTIF(AB$4:AB$44, \"P\"))","v":""},{"$f":"IF(I45=\"\",\"\",COUNTIF(AC$4:AC$44, \"P\"))","v":""},{"$f":"IF(J45=\"\",\"\",COUNTIF(AD$4:AD$44, \"P\"))","v":""},{"$f":"IF(K45=\"\",\"\",COUNTIF(AE$4:AE$44, \"P\"))","v":""},{"$f":"IF(L45=\"\",\"\",COUNTIF(AF$4:AF$44, \"P\"))","v":""},{"$f":"IF(M45=\"\",\"\",COUNTIF(AG$4:AG$44, \"P\"))","v":""},{"$f":"IF(N45=\"\",\"\",COUNTIF(AH$4:AH$44, \"P\"))","v":""},{"$f":"IF(O45=\"\",\"\",COUNTIF(AI$4:AI$44, \"P\"))","v":""}]
[]
[null,"TOTAL ATTENDANCE PER MEETING",null,{"$f":"IF(D45=\"\",\"\",COUNTIFS(D4:D43,\"P\")+COUNTIFS(D4:D43, \"PC\"))","v":""},{"$f":"IF(E45=\"\",\"\",COUNTIFS(E4:E43,\"P\")+COUNTIFS(E4:E43, \"PC\"))","v":""},{"$f":"IF(F45=\"\",\"\",COUNTIFS(F4:F43,\"P\")+COUNTIFS(F4:F43, \"PC\"))","v":""},{"$f":"IF(G45=\"\",\"\",COUNTIFS(G4:G43,\"P\")+COUNTIFS(G4:G43, \"PC\"))","v":""},{"$f":"IF(H45=\"\",\"\",COUNTIFS(H4:H43,\"P\")+COUNTIFS(H4:H43, \"PC\"))","v":""},{"$f":"IF(I45=\"\",\"\",COUNTIFS(I4:I43,\"P\")+COUNTIFS(I4:I43, \"PC\"))","v":""},{"$f":"IF(J45=\"\",\"\",COUNTIFS(J4:J43,\"P\")+COUNTIFS(J4:J43, \"PC\"))","v":""},{"$f":"IF(K45=\"\",\"\",COUNTIFS(K4:K43,\"P\")+COUNTIFS(K4:K43, \"PC\"))","v":""},{"$f":"IF(L45=\"\",\"\",COUNTIFS(L4:L43,\"P\")+COUNTIFS(L4:L43, \"PC\"))","v":""},{"$f":"IF(M45=\"\",\"\",COUNTIFS(M4:M43,\"P\")+COUNTIFS(M4:M43, \"PC\"))","v":""},{"$f":"IF(N45=\"\",\"\",COUNTIFS(N4:N43,\"P\")+COUNTIFS(N4:N43, \"PC\"))","v":""},{"$f":"IF(O45=\"\",\"\",COUNTIFS(O4:O43,\"P\")+COUNTIFS(O4:O43, \"PC\"))","v":""}]
[]
[null,"% Attended PER MEETING",null,{"$f":"IF(D45=\"\",\"\",D50/D45)","v":""},{"$f":"IF(E45=\"\",\"\",E50/E45)","v":""},"","","","","","","","","",""]
[]
[]
[null,"Definitions:"]
[null,"Excused","Previous notification to agency of not attending the meeting"]
[null,"Unexcused","No previous notification to the agency and did not attend the meeting.  Could affect future status as a board member, per bylaws"]
[null,"Seated","Day the board votes individual on to the board, no matter sector of representation"]

{"sheet":"Summary","index":3,"n_rows":54,"n_cols":6,"rows_kept":54,"cut":false,"hidden":false,"merged":[[1,1,2,1],[11,5,12,5],[11,2,12,2],[11,3,12,3],[5,1,8,1],[11,1,12,1],[11,4,12,4]]}
[]
[null,"[IC-12-14-23-6]","Minimum # of Members","Current","Compliant?"]
[null,null,15,{"$f":"COUNTIF(Detail!C5:C44,\"Y\")","v":0},{"$f":"IF(D3=0,\"\",IF(D3>=C3,\"Yes\",\"No\"))","v":""}]
[]
[null,"TAB","Standard","Compliance"]
[null,"Detail","Voted on by Board",{"$f":"IF(COUNTA(Detail!B5:B44)=COUNTA(Detail!N5:N44),\"Yes\",\"No\")","v":"Yes"}]
[null,null,"Orientation",{"$f":"IF(COUNTIF(Summary!D15:D54,\"No\"),\"No\",\"Yes\")","v":"Yes"}]
[null,null,"Bylaws",{"$f":"IF(COUNTIF(Summary!E15:E54,\"No\"),\"No\",\"Yes\")","v":"Yes"}]
[null,null,"Conflict of Interest",{"$f":"IF(COUNTIF(Summary!F15:F54,\"No\"),\"No\",\"Yes\")","v":"Yes"}]
[null,"Composition","Composition",{"$f":"IF(COUNTIF(Composition!I5:I9,\"No\"),\"No\",\"Yes\")","v":"Yes"}]
[]
[null,"Name","Term End ","Orientation Compliant?            (within 6 months)","Bylaws Compliant? (within last 2 years)","Conflict of Interest Compliant? (within last 2 years)"]
[]
[null,null,"Autofill:\n DATE","AutoFill: \nYes/No","Autofill:                               Yes/No","Autofill:                                        Yes/No"]
[null,{"$f":"IF(ISBLANK(Detail!B5),\"\",Detail!B5)","v":""},{"$f":"IF(ISBLANK(Detail!O5),\"\",Detail!O5)","v":""},{"$f":"IF(Detail!C5=\"Y\",IF(ISBLANK(Detail!P5),IF(ISBLANK(Detail!N5),\"\",IF(Detail!N5<TODAY()-182.5,\"No\",\"\")),IF(Detail!N5>Detail!P5,\"No\",IF(Detail!N5+182.5>Detail!P5,\"Yes\",\"No\"))),\"\")","v":""},{"$f":"IF(Detail!C5=\"Y\",IF(ISBLANK(Detail!Q5), IF(ISBLANK(Detail!N5),\"\",IF(Detail!N5<TODAY()-730,\"No\",\"\")),IF(Detail!Q5>TODAY()-730,\"Yes\",\"No\")),\"\")","v":""},{"$f":"IF(Detail!C5=\"Y\",IF(ISBLANK(Detail!R5),IF(ISBLANK(Detail!N5),\"\",IF(Detail!N5<TODAY()-730,\"No\",\"\")),IF(Detail!R5>TODAY()-730,\"Yes\",\"No\")),\"\")","v":""}]
[null,{"$f":"IF(ISBLANK(Detail!B6),\"\",Detail!B6)","v":""},{"$f":"IF(ISBLANK(Detail!O6),\"\",Detail!O6)","v":""},{"$f":"IF(Detail!C6=\"Y\",IF(ISBLANK(Detail!P6),IF(ISBLANK(Detail!N6),\"\",IF(Detail!N6<TODAY()-182.5,\"No\",\"\")),IF(Detail!N6>Detail!P6,\"No\",IF(Detail!N6+182.5>Detail!P6,\"Yes\",\"No\"))),\"\")","v":""},{"$f":"IF(Detail!C6=\"Y\",IF(ISBLANK(Detail!Q6), IF(ISBLANK(Detail!N6),\"\",IF(Detail!N6<TODAY()-730,\"No\",\"\")),IF(Detail!Q6>TODAY()-730,\"Yes\",\"No\")),\"\")","v":""},{"$f":"IF(Detail!C6=\"Y\",IF(ISBLANK(Detail!R6),IF(ISBLANK(Detail!N6),\"\",IF(Detail!N6<TODAY()-730,\"No\",\"\")),IF(Detail!R6>TODAY()-730,\"Yes\",\"No\")),\"\")","v":""}]
[null,{"$f":"IF(ISBLANK(Detail!B7),\"\",Detail!B7)","v":""},{"$f":"IF(ISBLANK(Detail!O7),\"\",Detail!O7)","v":""},{"$f":"IF(Detail!C7=\"Y\",IF(ISBLANK(Detail!P7),IF(ISBLANK(Detail!N7),\"\",IF(Detail!N7<TODAY()-182.5,\"No\",\"\")),IF(Detail!N7>Detail!P7,\"No\",IF(Detail!N7+182.5>Detail!P7,\"Yes\",\"No\"))),\"\")","v":""},{"$f":"IF(Detail!C7=\"Y\",IF(ISBLANK(Detail!Q7), IF(ISBLANK(Detail!N7),\"\",IF(Detail!N7<TODAY()-730,\"No\",\"\")),IF(Detail!Q7>TODAY()-730,\"Yes\",\"No\")),\"\")","v":""},{"$f":"IF(Detail!C7=\"Y\",IF(ISBLANK(Detail!R7),IF(ISBLANK(Detail!N7),\"\",IF(Detail!N7<TODAY()-730,\"No\",\"\")),IF(Detail!R7>TODAY()-730,\"Yes\",\"No\")),\"\")","v":""}]
[null,{"$f":"IF(ISBLANK(Detail!B8),\"\",Detail!B8)","v":""},{"$f":"IF(ISBLANK(Detail!O8),\"\",Detail!O8)","v":""},{"$f":"IF(Detail!C8=\"Y\",IF(ISBLANK(Detail!P8),IF(ISBLANK(Detail!N8),\"\",IF(Detail!N8<TODAY()-182.5,\"No\",\"\")),IF(Detail!N8>Detail!P8,\"No\",IF(Detail!N8+182.5>Detail!P8,\"Yes\",\"No\"))),\"\")","v":""},{"$f":"IF(Detail!C8=\"Y\",IF(ISBLANK(Detail!Q8), IF(ISBLANK(Detail!N8),\"\",IF(Detail!N8<TODAY()-730,\"No\",\"\")),IF(Detail!Q8>TODAY()-730,\"Yes\",\"No\")),\"\")","v":""},{"$f":"IF(Detail!C8=\"Y\",IF(ISBLANK(Detail!R8),IF(ISBLANK(Detail!N8),\"\",IF(Detail!N8<TODAY()-730,\"No\",\"\")),IF(Detail!R8>TODAY()-730,\"Yes\",\"No\")),\"\")","v":""}]
[null,{"$f":"IF(ISBLANK(Detail!B9),\"\",Detail!B9)","v":""},{"$f":"IF(ISBLANK(Detail!O9),\"\",Detail!O9)","v":""},{"$f":"IF(Detail!C9=\"Y\",IF(ISBLANK(Detail!P9),IF(ISBLANK(Detail!N9),\"\",IF(Detail!N9<TODAY()-182.5,\"No\",\"\")),IF(Detail!N9>Detail!P9,\"No\",IF(Detail!N9+182.5>Detail!P9,\"Yes\",\"No\"))),\"\")","v":""},{"$f":"IF(Detail!C9=\"Y\",IF(ISBLANK(Detail!Q9), IF(ISBLANK(Detail!N9),\"\",IF(Detail!N9<TODAY()-730,\"No\",\"\")),IF(Detail!Q9>TODAY()-730,\"Yes\",\"No\")),\"\")","v":""},{"$f":"IF(Detail!C9=\"Y\",IF(ISBLANK(Detail!R9),IF(ISBLANK(Detail!N9),\"\",IF(Detail!N9<TODAY()-730,\"No\",\"\")),IF(Detail!R9>TODAY()-730,\"Yes\",\"No\")),\"\")","v":""}]
[null,{"$f":"IF(ISBLANK(Detail!B10),\"\",Detail!B10)","v":""},{"$f":"IF(ISBLANK(Detail!O10),\"\",Detail!O10)","v":""},{"$f":"IF(Detail!C10=\"Y\",IF(ISBLANK(Detail!P10),IF(ISBLANK(Detail!N10),\"\",IF(Detail!N10<TODAY()-182.5,\"No\",\"\")),IF(Detail!N10>Detail!P10,\"No\",IF(Detail!N10+182.5>Detail!P10,\"Yes\",\"No\"))),\"\")","v":""},{"$f":"IF(Detail!C10=\"Y\",IF(ISBLANK(Detail!Q10), IF(ISBLANK(Detail!N10),\"\",IF(Detail!N10<TODAY()-730,\"No\",\"\")),IF(Detail!Q10>TODAY()-730,\"Yes\",\"No\")),\"\")","v":""},{"$f":"IF(Detail!C10=\"Y\",IF(ISBLANK(Detail!R10),IF(ISBLANK(Detail!N10),\"\",IF(Detail!N10<TODAY()-730,\"No\",\"\")),IF(Detail!R10>TODAY()-730,\"Yes\",\"No\")),\"\")","v":""}]
[null,{"$f":"IF(ISBLANK(Detail!B11),\"\",Detail!B11)","v":""},{"$f":"IF(ISBLANK(Detail!O11),\"\",Detail!O11)","v":""},{"$f":"IF(Detail!C11=\"Y\",IF(ISBLANK(Detail!P11),IF(ISBLANK(Detail!N11),\"\",IF(Detail!N11<TODAY()-182.5,\"No\",\"\")),IF(Detail!N11>Detail!P11,\"No\",IF(Detail!N11+182.5>Detail!P11,\"Yes\",\"No\"))),\"\")","v":""},{"$f":"IF(Detail!C11=\"Y\",IF(ISBLANK(Detail!Q11), IF(ISBLANK(Detail!N11),\"\",IF(Detail!N11<TODAY()-730,\"No\",\"\")),IF(Detail!Q11>TODAY()-730,\"Yes\",\"No\")),\"\")","v":""},{"$f":"IF(Detail!C11=\"Y\",IF(ISBLANK(Detail!R11),IF(ISBLANK(Detail!N11),\"\",IF(Detail!N11<TODAY()-730,\"No\",\"\")),IF(Detail!R11>TODAY()-730,\"Yes\",\"No\")),\"\")","v":""}]
[null,{"$f":"IF(ISBLANK(Detail!B12),\"\",Detail!B12)","v":""},{"$f":"IF(ISBLANK(Detail!O12),\"\",Detail!O12)","v":""},{"$f":"IF(Detail!C12=\"Y\",IF(ISBLANK(Detail!P12),IF(ISBLANK(Detail!N12),\"\",IF(Detail!N12<TODAY()-182.5,\"No\",\"\")),IF(Detail!N12>Detail!P12,\"No\",IF(Detail!N12+182.5>Detail!P12,\"Yes\",\"No\"))),\"\")","v":""},{"$f":"IF(Detail!C12=\"Y\",IF(ISBLANK(Detail!Q12), IF(ISBLANK(Detail!N12),\"\",IF(Detail!N12<TODAY()-730,\"No\",\"\")),IF(Detail!Q12>TODAY()-730,\"Yes\",\"No\")),\"\")","v":""},{"$f":"IF(Detail!C12=\"Y\",IF(ISBLANK(Detail!R12),IF(ISBLANK(Detail!N12),\"\",IF(Detail!N12<TODAY()-730,\"No\",\"\")),IF(Detail!R12>TODAY()-730,\"Yes\",\"No\")),\"\")","v":""}]
[null,{"$f":"IF(ISBLANK(Detail!B13),\"\",Detail!B13)","v":""},{"$f":"IF(ISBLANK(Detail!O13),\"\",Detail!O13)","v":""},{"$f":"IF(Detail!C13=\"Y\",IF(ISBLANK(Detail!P13),IF(ISBLANK(Detail!N13),\"\",IF(Detail!N13<TODAY()-182.5,\"No\",\"\")),IF(Detail!N13>Detail!P13,\"No\",IF(Detail!N13+182.5>Detail!P13,\"Yes\",\"No\"))),\"\")","v":""},{"$f":"IF(Detail!C13=\"Y\",IF(ISBLANK(Detail!Q13), IF(ISBLANK(Detail!N13),\"\",IF(Detail!N13<TODAY()-730,\"No\",\"\")),IF(Detail!Q13>TODAY()-730,\"Yes\",\"No\")),\"\")","v":""},{"$f":"IF(Detail!C13=\"Y\",IF(ISBLANK(Detail!R13),IF(ISBLANK(Detail!N13),\"\",IF(Detail!N13<TODAY()-730,\"No\",\"\")),IF(Detail!R13>TODAY()-730,\"Yes\",\"No\")),\"\")","v":""}]
[null,{"$f":"IF(ISBLANK(Detail!B14),\"\",Detail!B14)","v":""},{"$f":"IF(ISBLANK(Detail!O14),\"\",Detail!O14)","v":""},{"$f":"IF(Detail!C14=\"Y\",IF(ISBLANK(Detail!P14),IF(ISBLANK(Detail!N14),\"\",IF(Detail!N14<TODAY()-182.5,\"No\",\"\")),IF(Detail!N14>Detail!P14,\"No\",IF(Detail!N14+182.5>Detail!P14,\"Yes\",\"No\"))),\"\")","v":""},{"$f":"IF(Detail!C14=\"Y\",IF(ISBLANK(Detail!Q14), IF(ISBLANK(Detail!N14),\"\",IF(Detail!N14<TODAY()-730,\"No\",\"\")),IF(Detail!Q14>TODAY()-730,\"Yes\",\"No\")),\"\")","v":""},{"$f":"IF(Detail!C14=\"Y\",IF(ISBLANK(Detail!R14),IF(ISBLANK(Detail!N14),\"\",IF(Detail!N14<TODAY()-730,\"No\",\"\")),IF(Detail!R14>TODAY()-730,\"Yes\",\"No\")),\"\")","v":""}]
[null,{"$f":"IF(ISBLANK(Detail!B15),\"\",Detail!B15)","v":""},{"$f":"IF(ISBLANK(Detail!O15),\"\",Detail!O15)","v":""},{"$f":"IF(Detail!C15=\"Y\",IF(ISBLANK(Detail!P15),IF(ISBLANK(Detail!N15),\"\",IF(Detail!N15<TODAY()-182.5,\"No\",\"\")),IF(Detail!N15>Detail!P15,\"No\",IF(Detail!N15+182.5>Detail!P15,\"Yes\",\"No\"))),\"\")","v":""},{"$f":"IF(Detail!C15=\"Y\",IF(ISBLANK(Detail!Q15), IF(ISBLANK(Detail!N15),\"\",IF(Detail!N15<TODAY()-730,\"No\",\"\")),IF(Detail!Q15>TODAY()-730,\"Yes\",\"No\")),\"\")","v":""},{"$f":"IF(Detail!C15=\"Y\",IF(ISBLANK(Detail!R15),IF(ISBLANK(Detail!N15),\"\",IF(Detail!N15<TODAY()-730,\"No\",\"\")),IF(Detail!R15>TODAY()-730,\"Yes\",\"No\")),\"\")","v":""}]
[null,{"$f":"IF(ISBLANK(Detail!B16),\"\",Detail!B16)","v":""},{"$f":"IF(ISBLANK(Detail!O16),\"\",Detail!O16)","v":""},{"$f":"IF(Detail!C16=\"Y\",IF(ISBLANK(Detail!P16),IF(ISBLANK(Detail!N16),\"\",IF(Detail!N16<TODAY()-182.5,\"No\",\"\")),IF(Detail!N16>Detail!P16,\"No\",IF(Detail!N16+182.5>Detail!P16,\"Yes\",\"No\"))),\"\")","v":""},{"$f":"IF(Detail!C16=\"Y\",IF(ISBLANK(Detail!Q16), IF(ISBLANK(Detail!N16),\"\",IF(Detail!N16<TODAY()-730,\"No\",\"\")),IF(Detail!Q16>TODAY()-730,\"Yes\",\"No\")),\"\")","v":""},{"$f":"IF(Detail!C16=\"Y\",IF(ISBLANK(Detail!R16),IF(ISBLANK(Detail!N16),\"\",IF(Detail!N16<TODAY()-730,\"No\",\"\")),IF(Detail!R16>TODAY()-730,\"Yes\",\"No\")),\"\")","v":""}]
[null,{"$f":"IF(ISBLANK(Detail!B17),\"\",Detail!B17)","v":""},{"$f":"IF(ISBLANK(Detail!O17),\"\",Detail!O17)","v":""},{"$f":"IF(Detail!C17=\"Y\",IF(ISBLANK(Detail!P17),IF(ISBLANK(Detail!N17),\"\",IF(Detail!N17<TODAY()-182.5,\"No\",\"\")),IF(Detail!N17>Detail!P17,\"No\",IF(Detail!N17+182.5>Detail!P17,\"Yes\",\"No\"))),\"\")","v":""},{"$f":"IF(Detail!C17=\"Y\",IF(ISBLANK(Detail!Q17), IF(ISBLANK(Detail!N17),\"\",IF(Detail!N17<TODAY()-730,\"No\",\"\")),IF(Detail!Q17>TODAY()-730,\"Yes\",\"No\")),\"\")","v":""},{"$f":"IF(Detail!C17=\"Y\",IF(ISBLANK(Detail!R17),IF(ISBLANK(Detail!N17),\"\",IF(Detail!N17<TODAY()-730,\"No\",\"\")),IF(Detail!R17>TODAY()-730,\"Yes\",\"No\")),\"\")","v":""}]
[null,{"$f":"IF(ISBLANK(Detail!B18),\"\",Detail!B18)","v":""},{"$f":"IF(ISBLANK(Detail!O18),\"\",Detail!O18)","v":""},{"$f":"IF(Detail!C18=\"Y\",IF(ISBLANK(Detail!P18),IF(ISBLANK(Detail!N18),\"\",IF(Detail!N18<TODAY()-182.5,\"No\",\"\")),IF(Detail!N18>Detail!P18,\"No\",IF(Detail!N18+182.5>Detail!P18,\"Yes\",\"No\"))),\"\")","v":""},{"$f":"IF(Detail!C18=\"Y\",IF(ISBLANK(Detail!Q18), IF(ISBLANK(Detail!N18),\"\",IF(Detail!N18<TODAY()-730,\"No\",\"\")),IF(Detail!Q18>TODAY()-730,\"Yes\",\"No\")),\"\")","v":""},{"$f":"IF(Detail!C18=\"Y\",IF(ISBLANK(Detail!R18),IF(ISBLANK(Detail!N18),\"\",IF(Detail!N18<TODAY()-730,\"No\",\"\")),IF(Detail!R18>TODAY()-730,\"Yes\",\"No\")),\"\")","v":""}]
[null,{"$f":"IF(ISBLANK(Detail!B19),\"\",Detail!B19)","v":""},{"$f":"IF(ISBLANK(Detail!O19),\"\",Detail!O19)","v":""},{"$f":"IF(Detail!C19=\"Y\",IF(ISBLANK(Detail!P19),IF(ISBLANK(Detail!N19),\"\",IF(Detail!N19<TODAY()-182.5,\"No\",\"\")),IF(Detail!N19>Detail!P19,\"No\",IF(Detail!N19+182.5>Detail!P19,\"Yes\",\"No\"))),\"\")","v":""},{"$f":"IF(Detail!C19=\"Y\",IF(ISBLANK(Detail!Q19), IF(ISBLANK(Detail!N19),\"\",IF(Detail!N19<TODAY()-730,\"No\",\"\")),IF(Detail!Q19>TODAY()-730,\"Yes\",\"No\")),\"\")","v":""},{"$f":"IF(Detail!C19=\"Y\",IF(ISBLANK(Detail!R19),IF(ISBLANK(Detail!N19),\"\",IF(Detail!N19<TODAY()-730,\"No\",\"\")),IF(Detail!R19>TODAY()-730,\"Yes\",\"No\")),\"\")","v":""}]
[null,{"$f":"IF(ISBLANK(Detail!B20),\"\",Detail!B20)","v":""},{"$f":"IF(ISBLANK(Detail!O20),\"\",Detail!O20)","v":""},{"$f":"IF(Detail!C20=\"Y\",IF(ISBLANK(Detail!P20),IF(ISBLANK(Detail!N20),\"\",IF(Detail!N20<TODAY()-182.5,\"No\",\"\")),IF(Detail!N20>Detail!P20,\"No\",IF(Detail!N20+182.5>Detail!P20,\"Yes\",\"No\"))),\"\")","v":""},{"$f":"IF(Detail!C20=\"Y\",IF(ISBLANK(Detail!Q20), IF(ISBLANK(Detail!N20),\"\",IF(Detail!N20<TODAY()-730,\"No\",\"\")),IF(Detail!Q20>TODAY()-730,\"Yes\",\"No\")),\"\")","v":""},{"$f":"IF(Detail!C20=\"Y\",IF(ISBLANK(Detail!R20),IF(ISBLANK(Detail!N20),\"\",IF(Detail!N20<TODAY()-730,\"No\",\"\")),IF(Detail!R20>TODAY()-730,\"Yes\",\"No\")),\"\")","v":""}]
[null,{"$f":"IF(ISBLANK(Detail!B21),\"\",Detail!B21)","v":""},{"$f":"IF(ISBLANK(Detail!O21),\"\",Detail!O21)","v":""},{"$f":"IF(Detail!C21=\"Y\",IF(ISBLANK(Detail!P21),IF(ISBLANK(Detail!N21),\"\",IF(Detail!N21<TODAY()-182.5,\"No\",\"\")),IF(Detail!N21>Detail!P21,\"No\",IF(Detail!N21+182.5>Detail!P21,\"Yes\",\"No\"))),\"\")","v":""},{"$f":"IF(Detail!C21=\"Y\",IF(ISBLANK(Detail!Q21), IF(ISBLANK(Detail!N21),\"\",IF(Detail!N21<TODAY()-730,\"No\",\"\")),IF(Detail!Q21>TODAY()-730,\"Yes\",\"No\")),\"\")","v":""},{"$f":"IF(Detail!C21=\"Y\",IF(ISBLANK(Detail!R21),IF(ISBLANK(Detail!N21),\"\",IF(Detail!N21<TODAY()-730,\"No\",\"\")),IF(Detail!R21>TODAY()-730,\"Yes\",\"No\")),\"\")","v":""}]
[null,{"$f":"IF(ISBLANK(Detail!B22),\"\",Detail!B22)","v":""},{"$f":"IF(ISBLANK(Detail!O22),\"\",Detail!O22)","v":""},{"$f":"IF(Detail!C22=\"Y\",IF(ISBLANK(Detail!P22),IF(ISBLANK(Detail!N22),\"\",IF(Detail!N22<TODAY()-182.5,\"No\",\"\")),IF(Detail!N22>Detail!P22,\"No\",IF(Detail!N22+182.5>Detail!P22,\"Yes\",\"No\"))),\"\")","v":""},{"$f":"IF(Detail!C22=\"Y\",IF(ISBLANK(Detail!Q22), IF(ISBLANK(Detail!N22),\"\",IF(Detail!N22<TODAY()-730,\"No\",\"\")),IF(Detail!Q22>TODAY()-730,\"Yes\",\"No\")),\"\")","v":""},{"$f":"IF(Detail!C22=\"Y\",IF(ISBLANK(Detail!R22),IF(ISBLANK(Detail!N22),\"\",IF(Detail!N22<TODAY()-730,\"No\",\"\")),IF(Detail!R22>TODAY()-730,\"Yes\",\"No\")),\"\")","v":""}]
[null,{"$f":"IF(ISBLANK(Detail!B23),\"\",Detail!B23)","v":""},{"$f":"IF(ISBLANK(Detail!O23),\"\",Detail!O23)","v":""},{"$f":"IF(Detail!C23=\"Y\",IF(ISBLANK(Detail!P23),IF(ISBLANK(Detail!N23),\"\",IF(Detail!N23<TODAY()-182.5,\"No\",\"\")),IF(Detail!N23>Detail!P23,\"No\",IF(Detail!N23+182.5>Detail!P23,\"Yes\",\"No\"))),\"\")","v":""},{"$f":"IF(Detail!C23=\"Y\",IF(ISBLANK(Detail!Q23), IF(ISBLANK(Detail!N23),\"\",IF(Detail!N23<TODAY()-730,\"No\",\"\")),IF(Detail!Q23>TODAY()-730,\"Yes\",\"No\")),\"\")","v":""},{"$f":"IF(Detail!C23=\"Y\",IF(ISBLANK(Detail!R23),IF(ISBLANK(Detail!N23),\"\",IF(Detail!N23<TODAY()-730,\"No\",\"\")),IF(Detail!R23>TODAY()-730,\"Yes\",\"No\")),\"\")","v":""}]
[null,{"$f":"IF(ISBLANK(Detail!B24),\"\",Detail!B24)","v":""},{"$f":"IF(ISBLANK(Detail!O24),\"\",Detail!O24)","v":""},{"$f":"IF(Detail!C24=\"Y\",IF(ISBLANK(Detail!P24),IF(ISBLANK(Detail!N24),\"\",IF(Detail!N24<TODAY()-182.5,\"No\",\"\")),IF(Detail!N24>Detail!P24,\"No\",IF(Detail!N24+182.5>Detail!P24,\"Yes\",\"No\"))),\"\")","v":""},{"$f":"IF(Detail!C24=\"Y\",IF(ISBLANK(Detail!Q24), IF(ISBLANK(Detail!N24),\"\",IF(Detail!N24<TODAY()-730,\"No\",\"\")),IF(Detail!Q24>TODAY()-730,\"Yes\",\"No\")),\"\")","v":""},{"$f":"IF(Detail!C24=\"Y\",IF(ISBLANK(Detail!R24),IF(ISBLANK(Detail!N24),\"\",IF(Detail!N24<TODAY()-730,\"No\",\"\")),IF(Detail!R24>TODAY()-730,\"Yes\",\"No\")),\"\")","v":""}]
[null,{"$f":"IF(ISBLANK(Detail!B25),\"\",Detail!B25)","v":""},{"$f":"IF(ISBLANK(Detail!O25),\"\",Detail!O25)","v":""},{"$f":"IF(Detail!C25=\"Y\",IF(ISBLANK(Detail!P25),IF(ISBLANK(Detail!N25),\"\",IF(Detail!N25<TODAY()-182.5,\"No\",\"\")),IF(Detail!N25>Detail!P25,\"No\",IF(Detail!N25+182.5>Detail!P25,\"Yes\",\"No\"))),\"\")","v":""},{"$f":"IF(Detail!C25=\"Y\",IF(ISBLANK(Detail!Q25), IF(ISBLANK(Detail!N25),\"\",IF(Detail!N25<TODAY()-730,\"No\",\"\")),IF(Detail!Q25>TODAY()-730,\"Yes\",\"No\")),\"\")","v":""},{"$f":"IF(Detail!C25=\"Y\",IF(ISBLANK(Detail!R25),IF(ISBLANK(Detail!N25),\"\",IF(Detail!N25<TODAY()-730,\"No\",\"\")),IF(Detail!R25>TODAY()-730,\"Yes\",\"No\")),\"\")","v":""}]
[null,{"$f":"IF(ISBLANK(Detail!B26),\"\",Detail!B26)","v":""},{"$f":"IF(ISBLANK(Detail!O26),\"\",Detail!O26)","v":""},{"$f":"IF(Detail!C26=\"Y\",IF(ISBLANK(Detail!P26),IF(ISBLANK(Detail!N26),\"\",IF(Detail!N26<TODAY()-182.5,\"No\",\"\")),IF(Detail!N26>Detail!P26,\"No\",IF(Detail!N26+182.5>Detail!P26,\"Yes\",\"No\"))),\"\")","v":""},{"$f":"IF(Detail!C26=\"Y\",IF(ISBLANK(Detail!Q26), IF(ISBLANK(Detail!N26),\"\",IF(Detail!N26<TODAY()-730,\"No\",\"\")),IF(Detail!Q26>TODAY()-730,\"Yes\",\"No\")),\"\")","v":""},{"$f":"IF(Detail!C26=\"Y\",IF(ISBLANK(Detail!R26),IF(ISBLANK(Detail!N26),\"\",IF(Detail!N26<TODAY()-730,\"No\",\"\")),IF(Detail!R26>TODAY()-730,\"Yes\",\"No\")),\"\")","v":""}]
[null,{"$f":"IF(ISBLANK(Detail!B27),\"\",Detail!B27)","v":""},{"$f":"IF(ISBLANK(Detail!O27),\"\",Detail!O27)","v":""},{"$f":"IF(Detail!C27=\"Y\",IF(ISBLANK(Detail!P27),IF(ISBLANK(Detail!N27),\"\",IF(Detail!N27<TODAY()-182.5,\"No\",\"\")),IF(Detail!N27>Detail!P27,\"No\",IF(Detail!N27+182.5>Detail!P27,\"Yes\",\"No\"))),\"\")","v":""},{"$f":"IF(Detail!C27=\"Y\",IF(ISBLANK(Detail!Q27), IF(ISBLANK(Detail!N27),\"\",IF(Detail!N27<TODAY()-730,\"No\",\"\")),IF(Detail!Q27>TODAY()-730,\"Yes\",\"No\")),\"\")","v":""},{"$f":"IF(Detail!C27=\"Y\",IF(ISBLANK(Detail!R27),IF(ISBLANK(Detail!N27),\"\",IF(Detail!N27<TODAY()-730,\"No\",\"\")),IF(Detail!R27>TODAY()-730,\"Yes\",\"No\")),\"\")","v":""}]
[null,{"$f":"IF(ISBLANK(Detail!B28),\"\",Detail!B28)","v":""},{"$f":"IF(ISBLANK(Detail!O28),\"\",Detail!O28)","v":""},{"$f":"IF(Detail!C28=\"Y\",IF(ISBLANK(Detail!P28),IF(ISBLANK(Detail!N28),\"\",IF(Detail!N28<TODAY()-182.5,\"No\",\"\")),IF(Detail!N28>Detail!P28,\"No\",IF(Detail!N28+182.5>Detail!P28,\"Yes\",\"No\"))),\"\")","v":""},{"$f":"IF(Detail!C28=\"Y\",IF(ISBLANK(Detail!Q28), IF(ISBLANK(Detail!N28),\"\",IF(Detail!N28<TODAY()-730,\"No\",\"\")),IF(Detail!Q28>TODAY()-730,\"Yes\",\"No\")),\"\")","v":""},{"$f":"IF(Detail!C28=\"Y\",IF(ISBLANK(Detail!R28),IF(ISBLANK(Detail!N28),\"\",IF(Detail!N28<TODAY()-730,\"No\",\"\")),IF(Detail!R28>TODAY()-730,\"Yes\",\"No\")),\"\")","v":""}]
[null,{"$f":"IF(ISBLANK(Detail!B29),\"\",Detail!B29)","v":""},{"$f":"IF(ISBLANK(Detail!O29),\"\",Detail!O29)","v":""},{"$f":"IF(Detail!C29=\"Y\",IF(ISBLANK(Detail!P29),IF(ISBLANK(Detail!N29),\"\",IF(Detail!N29<TODAY()-182.5,\"No\",\"\")),IF(Detail!N29>Detail!P29,\"No\",IF(Detail!N29+182.5>Detail!P29,\"Yes\",\"No\"))),\"\")","v":""},{"$f":"IF(Detail!C29=\"Y\",IF(ISBLANK(Detail!Q29), IF(ISBLANK(Detail!N29),\"\",IF(Detail!N29<TODAY()-730,\"No\",\"\")),IF(Detail!Q29>TODAY()-730,\"Yes\",\"No\")),\"\")","v":""},{"$f":"IF(Detail!C29=\"Y\",IF(ISBLANK(Detail!R29),IF(ISBLANK(Detail!N29),\"\",IF(Detail!N29<TODAY()-730,\"No\",\"\")),IF(Detail!R29>TODAY()-730,\"Yes\",\"No\")),\"\")","v":""}]
[null,{"$f":"IF(ISBLANK(Detail!B30),\"\",Detail!B30)","v":""},{"$f":"IF(ISBLANK(Detail!O30),\"\",Detail!O30)","v":""},{"$f":"IF(Detail!C30=\"Y\",IF(ISBLANK(Detail!P30),IF(ISBLANK(Detail!N30),\"\",IF(Detail!N30<TODAY()-182.5,\"No\",\"\")),IF(Detail!N30>Detail!P30,\"No\",IF(Detail!N30+182.5>Detail!P30,\"Yes\",\"No\"))),\"\")","v":""},{"$f":"IF(Detail!C30=\"Y\",IF(ISBLANK(Detail!Q30), IF(ISBLANK(Detail!N30),\"\",IF(Detail!N30<TODAY()-730,\"No\",\"\")),IF(Detail!Q30>TODAY()-730,\"Yes\",\"No\")),\"\")","v":""},{"$f":"IF(Detail!C30=\"Y\",IF(ISBLANK(Detail!R30),IF(ISBLANK(Detail!N30),\"\",IF(Detail!N30<TODAY()-730,\"No\",\"\")),IF(Detail!R30>TODAY()-730,\"Yes\",\"No\")),\"\")","v":""}]
[null,{"$f":"IF(ISBLANK(Detail!B31),\"\",Detail!B31)","v":""},{"$f":"IF(ISBLANK(Detail!O31),\"\",Detail!O31)","v":""},{"$f":"IF(Detail!C31=\"Y\",IF(ISBLANK(Detail!P31),IF(ISBLANK(Detail!N31),\"\",IF(Detail!N31<TODAY()-182.5,\"No\",\"\")),IF(Detail!N31>Detail!P31,\"No\",IF(Detail!N31+182.5>Detail!P31,\"Yes\",\"No\"))),\"\")","v":""},{"$f":"IF(Detail!C31=\"Y\",IF(ISBLANK(Detail!Q31), IF(ISBLANK(Detail!N31),\"\",IF(Detail!N31<TODAY()-730,\"No\",\"\")),IF(Detail!Q31>TODAY()-730,\"Yes\",\"No\")),\"\")","v":""},{"$f":"IF(Detail!C31=\"Y\",IF(ISBLANK(Detail!R31),IF(ISBLANK(Detail!N31),\"\",IF(Detail!N31<TODAY()-730,\"No\",\"\")),IF(Detail!R31>TODAY()-730,\"Yes\",\"No\")),\"\")","v":""}]
[null,{"$f":"IF(ISBLANK(Detail!B32),\"\",Detail!B32)","v":""},{"$f":"IF(ISBLANK(Detail!O32),\"\",Detail!O32)","v":""},{"$f":"IF(Detail!C32=\"Y\",IF(ISBLANK(Detail!P32),IF(ISBLANK(Detail!N32),\"\",IF(Detail!N32<TODAY()-182.5,\"No\",\"\")),IF(Detail!N32>Detail!P32,\"No\",IF(Detail!N32+182.5>Detail!P32,\"Yes\",\"No\"))),\"\")","v":""},{"$f":"IF(Detail!C32=\"Y\",IF(ISBLANK(Detail!Q32), IF(ISBLANK(Detail!N32),\"\",IF(Detail!N32<TODAY()-730,\"No\",\"\")),IF(Detail!Q32>TODAY()-730,\"Yes\",\"No\")),\"\")","v":""},{"$f":"IF(Detail!C32=\"Y\",IF(ISBLANK(Detail!R32),IF(ISBLANK(Detail!N32),\"\",IF(Detail!N32<TODAY()-730,\"No\",\"\")),IF(Detail!R32>TODAY()-730,\"Yes\",\"No\")),\"\")","v":""}]
[null,{"$f":"IF(ISBLANK(Detail!B33),\"\",Detail!B33)","v":""},{"$f":"IF(ISBLANK(Detail!O33),\"\",Detail!O33)","v":""},{"$f":"IF(Detail!C33=\"Y\",IF(ISBLANK(Detail!P33),IF(ISBLANK(Detail!N33),\"\",IF(Detail!N33<TODAY()-182.5,\"No\",\"\")),IF(Detail!N33>Detail!P33,\"No\",IF(Detail!N33+182.5>Detail!P33,\"Yes\",\"No\"))),\"\")","v":""},{"$f":"IF(Detail!C33=\"Y\",IF(ISBLANK(Detail!Q33), IF(ISBLANK(Detail!N33),\"\",IF(Detail!N33<TODAY()-730,\"No\",\"\")),IF(Detail!Q33>TODAY()-730,\"Yes\",\"No\")),\"\")","v":""},{"$f":"IF(Detail!C33=\"Y\",IF(ISBLANK(Detail!R33),IF(ISBLANK(Detail!N33),\"\",IF(Detail!N33<TODAY()-730,\"No\",\"\")),IF(Detail!R33>TODAY()-730,\"Yes\",\"No\")),\"\")","v":""}]
[null,{"$f":"IF(ISBLANK(Detail!B34),\"\",Detail!B34)","v":""},{"$f":"IF(ISBLANK(Detail!O34),\"\",Detail!O34)","v":""},{"$f":"IF(Detail!C34=\"Y\",IF(ISBLANK(Detail!P34),IF(ISBLANK(Detail!N34),\"\",IF(Detail!N34<TODAY()-182.5,\"No\",\"\")),IF(Detail!N34>Detail!P34,\"No\",IF(Detail!N34+182.5>Detail!P34,\"Yes\",\"No\"))),\"\")","v":""},{"$f":"IF(Detail!C34=\"Y\",IF(ISBLANK(Detail!Q34), IF(ISBLANK(Detail!N34),\"\",IF(Detail!N34<TODAY()-730,\"No\",\"\")),IF(Detail!Q34>TODAY()-730,\"Yes\",\"No\")),\"\")","v":""},{"$f":"IF(Detail!C34=\"Y\",IF(ISBLANK(Detail!R34),IF(ISBLANK(Detail!N34),\"\",IF(Detail!N34<TODAY()-730,\"No\",\"\")),IF(Detail!R34>TODAY()-730,\"Yes\",\"No\")),\"\")","v":""}]
[null,{"$f":"IF(ISBLANK(Detail!B35),\"\",Detail!B35)","v":""},{"$f":"IF(ISBLANK(Detail!O35),\"\",Detail!O35)","v":""},{"$f":"IF(Detail!C35=\"Y\",IF(ISBLANK(Detail!P35),IF(ISBLANK(Detail!N35),\"\",IF(Detail!N35<TODAY()-182.5,\"No\",\"\")),IF(Detail!N35>Detail!P35,\"No\",IF(Detail!N35+182.5>Detail!P35,\"Yes\",\"No\"))),\"\")","v":""},{"$f":"IF(Detail!C35=\"Y\",IF(ISBLANK(Detail!Q35), IF(ISBLANK(Detail!N35),\"\",IF(Detail!N35<TODAY()-730,\"No\",\"\")),IF(Detail!Q35>TODAY()-730,\"Yes\",\"No\")),\"\")","v":""},{"$f":"IF(Detail!C35=\"Y\",IF(ISBLANK(Detail!R35),IF(ISBLANK(Detail!N35),\"\",IF(Detail!N35<TODAY()-730,\"No\",\"\")),IF(Detail!R35>TODAY()-730,\"Yes\",\"No\")),\"\")","v":""}]
[null,{"$f":"IF(ISBLANK(Detail!B36),\"\",Detail!B36)","v":""},{"$f":"IF(ISBLANK(Detail!O36),\"\",Detail!O36)","v":""},{"$f":"IF(Detail!C36=\"Y\",IF(ISBLANK(Detail!P36),IF(ISBLANK(Detail!N36),\"\",IF(Detail!N36<TODAY()-182.5,\"No\",\"\")),IF(Detail!N36>Detail!P36,\"No\",IF(Detail!N36+182.5>Detail!P36,\"Yes\",\"No\"))),\"\")","v":""},{"$f":"IF(Detail!C36=\"Y\",IF(ISBLANK(Detail!Q36), IF(ISBLANK(Detail!N36),\"\",IF(Detail!N36<TODAY()-730,\"No\",\"\")),IF(Detail!Q36>TODAY()-730,\"Yes\",\"No\")),\"\")","v":""},{"$f":"IF(Detail!C36=\"Y\",IF(ISBLANK(Detail!R36),IF(ISBLANK(Detail!N36),\"\",IF(Detail!N36<TODAY()-730,\"No\",\"\")),IF(Detail!R36>TODAY()-730,\"Yes\",\"No\")),\"\")","v":""}]
[null,{"$f":"IF(ISBLANK(Detail!B37),\"\",Detail!B37)","v":""},{"$f":"IF(ISBLANK(Detail!O37),\"\",Detail!O37)","v":""},{"$f":"IF(Detail!C37=\"Y\",IF(ISBLANK(Detail!P37),IF(ISBLANK(Detail!N37),\"\",IF(Detail!N37<TODAY()-182.5,\"No\",\"\")),IF(Detail!N37>Detail!P37,\"No\",IF(Detail!N37+182.5>Detail!P37,\"Yes\",\"No\"))),\"\")","v":""},{"$f":"IF(Detail!C37=\"Y\",IF(ISBLANK(Detail!Q37), IF(ISBLANK(Detail!N37),\"\",IF(Detail!N37<TODAY()-730,\"No\",\"\")),IF(Detail!Q37>TODAY()-730,\"Yes\",\"No\")),\"\")","v":""},{"$f":"IF(Detail!C37=\"Y\",IF(ISBLANK(Detail!R37),IF(ISBLANK(Detail!N37),\"\",IF(Detail!N37<TODAY()-730,\"No\",\"\")),IF(Detail!R37>TODAY()-730,\"Yes\",\"No\")),\"\")","v":""}]
[null,{"$f":"IF(ISBLANK(Detail!B38),\"\",Detail!B38)","v":""},{"$f":"IF(ISBLANK(Detail!O38),\"\",Detail!O38)","v":""},{"$f":"IF(Detail!C38=\"Y\",IF(ISBLANK(Detail!P38),IF(ISBLANK(Detail!N38),\"\",IF(Detail!N38<TODAY()-182.5,\"No\",\"\")),IF(Detail!N38>Detail!P38,\"No\",IF(Detail!N38+182.5>Detail!P38,\"Yes\",\"No\"))),\"\")","v":""},{"$f":"IF(Detail!C38=\"Y\",IF(ISBLANK(Detail!Q38), IF(ISBLANK(Detail!N38),\"\",IF(Detail!N38<TODAY()-730,\"No\",\"\")),IF(Detail!Q38>TODAY()-730,\"Yes\",\"No\")),\"\")","v":""},{"$f":"IF(Detail!C38=\"Y\",IF(ISBLANK(Detail!R38),IF(ISBLANK(Detail!N38),\"\",IF(Detail!N38<TODAY()-730,\"No\",\"\")),IF(Detail!R38>TODAY()-730,\"Yes\",\"No\")),\"\")","v":""}]
[null,{"$f":"IF(ISBLANK(Detail!B39),\"\",Detail!B39)","v":""},{"$f":"IF(ISBLANK(Detail!O39),\"\",Detail!O39)","v":""},{"$f":"IF(Detail!C39=\"Y\",IF(ISBLANK(Detail!P39),IF(ISBLANK(Detail!N39),\"\",IF(Detail!N39<TODAY()-182.5,\"No\",\"\")),IF(Detail!N39>Detail!P39,\"No\",IF(Detail!N39+182.5>Detail!P39,\"Yes\",\"No\"))),\"\")","v":""},{"$f":"IF(Detail!C39=\"Y\",IF(ISBLANK(Detail!Q39), IF(ISBLANK(Detail!N39),\"\",IF(Detail!N39<TODAY()-730,\"No\",\"\")),IF(Detail!Q39>TODAY()-730,\"Yes\",\"No\")),\"\")","v":""},{"$f":"IF(Detail!C39=\"Y\",IF(ISBLANK(Detail!R39),IF(ISBLANK(Detail!N39),\"\",IF(Detail!N39<TODAY()-730,\"No\",\"\")),IF(Detail!R39>TODAY()-730,\"Yes\",\"No\")),\"\")","v":""}]
[null,{"$f":"IF(ISBLANK(Detail!B40),\"\",Detail!B40)","v":""},{"$f":"IF(ISBLANK(Detail!O40),\"\",Detail!O40)","v":""},{"$f":"IF(Detail!C40=\"Y\",IF(ISBLANK(Detail!P40),IF(ISBLANK(Detail!N40),\"\",IF(Detail!N40<TODAY()-182.5,\"No\",\"\")),IF(Detail!N40>Detail!P40,\"No\",IF(Detail!N40+182.5>Detail!P40,\"Yes\",\"No\"))),\"\")","v":""},{"$f":"IF(Detail!C40=\"Y\",IF(ISBLANK(Detail!Q40), IF(ISBLANK(Detail!N40),\"\",IF(Detail!N40<TODAY()-730,\"No\",\"\")),IF(Detail!Q40>TODAY()-730,\"Yes\",\"No\")),\"\")","v":""},{"$f":"IF(Detail!C40=\"Y\",IF(ISBLANK(Detail!R40),IF(ISBLANK(Detail!N40),\"\",IF(Detail!N40<TODAY()-730,\"No\",\"\")),IF(Detail!R40>TODAY()-730,\"Yes\",\"No\")),\"\")","v":""}]
[null,{"$f":"IF(ISBLANK(Detail!B41),\"\",Detail!B41)","v":""},{"$f":"IF(ISBLANK(Detail!O41),\"\",Detail!O41)","v":""},{"$f":"IF(Detail!C41=\"Y\",IF(ISBLANK(Detail!P41),IF(ISBLANK(Detail!N41),\"\",IF(Detail!N41<TODAY()-182.5,\"No\",\"\")),IF(Detail!N41>Detail!P41,\"No\",IF(Detail!N41+182.5>Detail!P41,\"Yes\",\"No\"))),\"\")","v":""},{"$f":"IF(Detail!C41=\"Y\",IF(ISBLANK(Detail!Q41), IF(ISBLANK(Detail!N41),\"\",IF(Detail!N41<TODAY()-730,\"No\",\"\")),IF(Detail!Q41>TODAY()-730,\"Yes\",\"No\")),\"\")","v":""},{"$f":"IF(Detail!C41=\"Y\",IF(ISBLANK(Detail!R41),IF(ISBLANK(Detail!N41),\"\",IF(Detail!N41<TODAY()-730,\"No\",\"\")),IF(Detail!R41>TODAY()-730,\"Yes\",\"No\")),\"\")","v":""}]
[null,{"$f":"IF(ISBLANK(Detail!B42),\"\",Detail!B42)","v":""},{"$f":"IF(ISBLANK(Detail!O42),\"\",Detail!O42)","v":""},{"$f":"IF(Detail!C42=\"Y\",IF(ISBLANK(Detail!P42),IF(ISBLANK(Detail!N42),\"\",IF(Detail!N42<TODAY()-182.5,\"No\",\"\")),IF(Detail!N42>Detail!P42,\"No\",IF(Detail!N42+182.5>Detail!P42,\"Yes\",\"No\"))),\"\")","v":""},{"$f":"IF(Detail!C42=\"Y\",IF(ISBLANK(Detail!Q42), IF(ISBLANK(Detail!N42),\"\",IF(Detail!N42<TODAY()-730,\"No\",\"\")),IF(Detail!Q42>TODAY()-730,\"Yes\",\"No\")),\"\")","v":""},{"$f":"IF(Detail!C42=\"Y\",IF(ISBLANK(Detail!R42),IF(ISBLANK(Detail!N42),\"\",IF(Detail!N42<TODAY()-730,\"No\",\"\")),IF(Detail!R42>TODAY()-730,\"Yes\",\"No\")),\"\")","v":""}]
[null,{"$f":"IF(ISBLANK(Detail!B43),\"\",Detail!B43)","v":""},{"$f":"IF(ISBLANK(Detail!O43),\"\",Detail!O43)","v":""},{"$f":"IF(Detail!C43=\"Y\",IF(ISBLANK(Detail!P43),IF(ISBLANK(Detail!N43),\"\",IF(Detail!N43<TODAY()-182.5,\"No\",\"\")),IF(Detail!N43>Detail!P43,\"No\",IF(Detail!N43+182.5>Detail!P43,\"Yes\",\"No\"))),\"\")","v":""},{"$f":"IF(Detail!C43=\"Y\",IF(ISBLANK(Detail!Q43), IF(ISBLANK(Detail!N43),\"\",IF(Detail!N43<TODAY()-730,\"No\",\"\")),IF(Detail!Q43>TODAY()-730,\"Yes\",\"No\")),\"\")","v":""},{"$f":"IF(Detail!C43=\"Y\",IF(ISBLANK(Detail!R43),IF(ISBLANK(Detail!N43),\"\",IF(Detail!N43<TODAY()-730,\"No\",\"\")),IF(Detail!R43>TODAY()-730,\"Yes\",\"No\")),\"\")","v":""}]
[null,{"$f":"IF(ISBLANK(Detail!B44),\"\",Detail!B44)","v":""},{"$f":"IF(ISBLANK(Detail!O44),\"\",Detail!O44)","v":""},{"$f":"IF(Detail!C44=\"Y\",IF(ISBLANK(Detail!P44),IF(ISBLANK(Detail!N44),\"\",IF(Detail!N44<TODAY()-182.5,\"No\",\"\")),IF(Detail!N44>Detail!P44,\"No\",IF(Detail!N44+182.5>Detail!P44,\"Yes\",\"No\"))),\"\")","v":""},{"$f":"IF(Detail!C44=\"Y\",IF(ISBLANK(Detail!Q44), IF(ISBLANK(Detail!N44),\"\",IF(Detail!N44<TODAY()-730,\"No\",\"\")),IF(Detail!Q44>TODAY()-730,\"Yes\",\"No\")),\"\")","v":""},{"$f":"IF(Detail!C44=\"Y\",IF(ISBLANK(Detail!R44),IF(ISBLANK(Detail!N44),\"\",IF(Detail!N44<TODAY()-730,\"No\",\"\")),IF(Detail!R44>TODAY()-730,\"Yes\",\"No\")),\"\")","v":""}]

{"sheet":"Composition","index":4,"n_rows":45,"n_cols":9,"rows_kept":45,"cut":false,"hidden":false,"merged":[[1,1,2,8],[8,6,8,7],[3,1,3,3],[17,5,17,8]]}
[]
[null,"Tripartite Compliance Indicator Sheet"]
[]
[null,"Sector",null,null,null,"Type","Number","Composition","Compliant?"]
[null,"Low Income (Consumer)","Public Official","Community (Private)",null,"Low Income",{"$f":"SUMPRODUCT(--NOT(ISERROR(B6:B45)))","v":0},{"$f":"IF(G9=0,\"\",G5/G9)","v":""},{"$f":"IF(G9=0,\"\",IF(H5>=0.33,\"Yes\",\"No\"))","v":""}]
[null,{"$f":"VLOOKUP(Formulas!$K2,Formulas!$A$2:$B$41,2,FALSE)","v":{"$error":"#N/A"}},{"$f":"VLOOKUP(Formulas!$K2,Formulas!$C$2:$D$41,2,FALSE)","v":{"$error":"#N/A"}},{"$f":"VLOOKUP(Formulas!$K2,Formulas!$E$2:$F$41,2,FALSE)","v":{"$error":"#N/A"}},null,"Public",{"$f":"SUMPRODUCT(--NOT(ISERROR(C6:C45)))","v":0},{"$f":"IF(G9=0,\"\",G6/G9)","v":""},{"$f":"IF(G9=0,\"\",IF(G6>G5,\"No\",IF(G6/G9>=0.33,\"Yes\",\"No\")))","v":""}]
[null,{"$f":"VLOOKUP(Formulas!$K3,Formulas!$A$2:$B$41,2,FALSE)","v":{"$error":"#N/A"}},{"$f":"VLOOKUP(Formulas!$K3,Formulas!$C$2:$D$41,2,FALSE)","v":{"$error":"#N/A"}},{"$f":"VLOOKUP(Formulas!$K3,Formulas!$E$2:$F$41,2,FALSE)","v":{"$error":"#N/A"}},null,"Community",{"$f":"SUMPRODUCT(--NOT(ISERROR(D6:D45)))","v":0},{"$f":"IF(G9=0,\"\",G7/G9)","v":""},{"$f":"IF(G9=0,\"\",IF(G7>G5,\"No\", IF(G7>G6,\"No\", \"Yes\")))","v":""}]
[null,{"$f":"VLOOKUP(Formulas!$K4,Formulas!$A$2:$B$41,2,FALSE)","v":{"$error":"#N/A"}},{"$f":"VLOOKUP(Formulas!$K4,Formulas!$C$2:$D$41,2,FALSE)","v":{"$error":"#N/A"}},{"$f":"VLOOKUP(Formulas!$K4,Formulas!$E$2:$F$41,2,FALSE)","v":{"$error":"#N/A"}}]
[null,{"$f":"VLOOKUP(Formulas!$K5,Formulas!$A$2:$B$41,2,FALSE)","v":{"$error":"#N/A"}},{"$f":"VLOOKUP(Formulas!$K5,Formulas!$C$2:$D$41,2,FALSE)","v":{"$error":"#N/A"}},{"$f":"VLOOKUP(Formulas!$K5,Formulas!$E$2:$F$41,2,FALSE)","v":{"$error":"#N/A"}},null,"Total",{"$f":"SUM(G5:G7)","v":0},null,{"$f":"IF(G9=0,\"\",IF(G9<51,IF(G9>=15, \"Yes\", \"No\"),\"No\"))","v":""}]
[null,{"$f":"VLOOKUP(Formulas!$K6,Formulas!$A$2:$B$41,2,FALSE)","v":{"$error":"#N/A"}},{"$f":"VLOOKUP(Formulas!$K6,Formulas!$C$2:$D$41,2,FALSE)","v":{"$error":"#N/A"}},{"$f":"VLOOKUP(Formulas!$K6,Formulas!$E$2:$F$41,2,FALSE)","v":{"$error":"#N/A"}}]
[null,{"$f":"VLOOKUP(Formulas!$K7,Formulas!$A$2:$B$41,2,FALSE)","v":{"$error":"#N/A"}},{"$f":"VLOOKUP(Formulas!$K7,Formulas!$C$2:$D$41,2,FALSE)","v":{"$error":"#N/A"}},{"$f":"VLOOKUP(Formulas!$K7,Formulas!$E$2:$F$41,2,FALSE)","v":{"$error":"#N/A"}}]
[null,{"$f":"VLOOKUP(Formulas!$K8,Formulas!$A$2:$B$41,2,FALSE)","v":{"$error":"#N/A"}},{"$f":"VLOOKUP(Formulas!$K8,Formulas!$C$2:$D$41,2,FALSE)","v":{"$error":"#N/A"}},{"$f":"VLOOKUP(Formulas!$K8,Formulas!$E$2:$F$41,2,FALSE)","v":{"$error":"#N/A"}},null,"CSBG Act Tripartite Compliance:  [42 USC (a)(2)(A)]"]
[null,{"$f":"VLOOKUP(Formulas!$K9,Formulas!$A$2:$B$41,2,FALSE)","v":{"$error":"#N/A"}},{"$f":"VLOOKUP(Formulas!$K9,Formulas!$C$2:$D$41,2,FALSE)","v":{"$error":"#N/A"}},{"$f":"VLOOKUP(Formulas!$K9,Formulas!$E$2:$F$41,2,FALSE)","v":{"$error":"#N/A"}},null,"1. At least one third democratically-selected representative of the low-income community "]
[null,{"$f":"VLOOKUP(Formulas!$K10,Formulas!$A$2:$B$41,2,FALSE)","v":{"$error":"#N/A"}},{"$f":"VLOOKUP(Formulas!$K10,Formulas!$C$2:$D$41,2,FALSE)","v":{"$error":"#N/A"}},{"$f":"VLOOKUP(Formulas!$K10,Formulas!$E$2:$F$41,2,FALSE)","v":{"$error":"#N/A"}},null,"2. One-third local elected (public) officials (or their representatives) "]
[null,{"$f":"VLOOKUP(Formulas!$K11,Formulas!$A$2:$B$41,2,FALSE)","v":{"$error":"#N/A"}},{"$f":"VLOOKUP(Formulas!$K11,Formulas!$C$2:$D$41,2,FALSE)","v":{"$error":"#N/A"}},{"$f":"VLOOKUP(Formulas!$K11,Formulas!$E$2:$F$41,2,FALSE)","v":{"$error":"#N/A"}},null,"3. The remaining membership from major groups and interests in the community (private)"]
[null,{"$f":"VLOOKUP(Formulas!$K12,Formulas!$A$2:$B$41,2,FALSE)","v":{"$error":"#N/A"}},{"$f":"VLOOKUP(Formulas!$K12,Formulas!$C$2:$D$41,2,FALSE)","v":{"$error":"#N/A"}},{"$f":"VLOOKUP(Formulas!$K12,Formulas!$E$2:$F$41,2,FALSE)","v":{"$error":"#N/A"}}]
[null,{"$f":"VLOOKUP(Formulas!$K13,Formulas!$A$2:$B$41,2,FALSE)","v":{"$error":"#N/A"}},{"$f":"VLOOKUP(Formulas!$K13,Formulas!$C$2:$D$41,2,FALSE)","v":{"$error":"#N/A"}},{"$f":"VLOOKUP(Formulas!$K13,Formulas!$E$2:$F$41,2,FALSE)","v":{"$error":"#N/A"}},null,"15 Member Board Composition Examples:"]
[null,{"$f":"VLOOKUP(Formulas!$K14,Formulas!$A$2:$B$41,2,FALSE)","v":{"$error":"#N/A"}},{"$f":"VLOOKUP(Formulas!$K14,Formulas!$C$2:$D$41,2,FALSE)","v":{"$error":"#N/A"}},{"$f":"VLOOKUP(Formulas!$K14,Formulas!$E$2:$F$41,2,FALSE)","v":{"$error":"#N/A"}},null,"Example: (5) public representatives, (5) low-income representatives and (5) community/private representatives"]
[null,{"$f":"VLOOKUP(Formulas!$K15,Formulas!$A$2:$B$41,2,FALSE)","v":{"$error":"#N/A"}},{"$f":"VLOOKUP(Formulas!$K15,Formulas!$C$2:$D$41,2,FALSE)","v":{"$error":"#N/A"}},{"$f":"VLOOKUP(Formulas!$K15,Formulas!$E$2:$F$41,2,FALSE)","v":{"$error":"#N/A"}},null,"Example: (3) public representatives, (6) low-income representatives and (6) community/private representatives"]
[null,{"$f":"VLOOKUP(Formulas!$K16,Formulas!$A$2:$B$41,2,FALSE)","v":{"$error":"#N/A"}},{"$f":"VLOOKUP(Formulas!$K16,Formulas!$C$2:$D$41,2,FALSE)","v":{"$error":"#N/A"}},{"$f":"VLOOKUP(Formulas!$K16,Formulas!$E$2:$F$41,2,FALSE)","v":{"$error":"#N/A"}}]
[null,{"$f":"VLOOKUP(Formulas!$K17,Formulas!$A$2:$B$41,2,FALSE)","v":{"$error":"#N/A"}},{"$f":"VLOOKUP(Formulas!$K17,Formulas!$C$2:$D$41,2,FALSE)","v":{"$error":"#N/A"}},{"$f":"VLOOKUP(Formulas!$K17,Formulas!$E$2:$F$41,2,FALSE)","v":{"$error":"#N/A"}},null,"General Operating Guidelines"]
[null,{"$f":"VLOOKUP(Formulas!$K18,Formulas!$A$2:$B$41,2,FALSE)","v":{"$error":"#N/A"}},{"$f":"VLOOKUP(Formulas!$K18,Formulas!$C$2:$D$41,2,FALSE)","v":{"$error":"#N/A"}},{"$f":"VLOOKUP(Formulas!$K18,Formulas!$E$2:$F$41,2,FALSE)","v":{"$error":"#N/A"}},null,"·   No group number can ever be higher than the low-income representatives"]
[null,{"$f":"VLOOKUP(Formulas!$K19,Formulas!$A$2:$B$41,2,FALSE)","v":{"$error":"#N/A"}},{"$f":"VLOOKUP(Formulas!$K19,Formulas!$C$2:$D$41,2,FALSE)","v":{"$error":"#N/A"}},{"$f":"VLOOKUP(Formulas!$K19,Formulas!$E$2:$F$41,2,FALSE)","v":{"$error":"#N/A"}},null,"·   When board composition is not divisible by three, it is best for the low-income and public groups to be equal numbers"]
[null,{"$f":"VLOOKUP(Formulas!$K20,Formulas!$A$2:$B$41,2,FALSE)","v":{"$error":"#N/A"}},{"$f":"VLOOKUP(Formulas!$K20,Formulas!$C$2:$D$41,2,FALSE)","v":{"$error":"#N/A"}},{"$f":"VLOOKUP(Formulas!$K20,Formulas!$E$2:$F$41,2,FALSE)","v":{"$error":"#N/A"}},null,"·   Governing boards have 90 days to fill any vacancy, no exceptions"]
[null,{"$f":"VLOOKUP(Formulas!$K21,Formulas!$A$2:$B$41,2,FALSE)","v":{"$error":"#N/A"}},{"$f":"VLOOKUP(Formulas!$K21,Formulas!$C$2:$D$41,2,FALSE)","v":{"$error":"#N/A"}},{"$f":"VLOOKUP(Formulas!$K21,Formulas!$E$2:$F$41,2,FALSE)","v":{"$error":"#N/A"}}]
[null,{"$f":"VLOOKUP(Formulas!$K22,Formulas!$A$2:$B$41,2,FALSE)","v":{"$error":"#N/A"}},{"$f":"VLOOKUP(Formulas!$K22,Formulas!$C$2:$D$41,2,FALSE)","v":{"$error":"#N/A"}},{"$f":"VLOOKUP(Formulas!$K22,Formulas!$E$2:$F$41,2,FALSE)","v":{"$error":"#N/A"}}]
[null,{"$f":"VLOOKUP(Formulas!$K23,Formulas!$A$2:$B$41,2,FALSE)","v":{"$error":"#N/A"}},{"$f":"VLOOKUP(Formulas!$K23,Formulas!$C$2:$D$41,2,FALSE)","v":{"$error":"#N/A"}},{"$f":"VLOOKUP(Formulas!$K23,Formulas!$E$2:$F$41,2,FALSE)","v":{"$error":"#N/A"}}]
[null,{"$f":"VLOOKUP(Formulas!$K24,Formulas!$A$2:$B$41,2,FALSE)","v":{"$error":"#N/A"}},{"$f":"VLOOKUP(Formulas!$K24,Formulas!$C$2:$D$41,2,FALSE)","v":{"$error":"#N/A"}},{"$f":"VLOOKUP(Formulas!$K24,Formulas!$E$2:$F$41,2,FALSE)","v":{"$error":"#N/A"}}]
[null,{"$f":"VLOOKUP(Formulas!$K25,Formulas!$A$2:$B$41,2,FALSE)","v":{"$error":"#N/A"}},{"$f":"VLOOKUP(Formulas!$K25,Formulas!$C$2:$D$41,2,FALSE)","v":{"$error":"#N/A"}},{"$f":"VLOOKUP(Formulas!$K25,Formulas!$E$2:$F$41,2,FALSE)","v":{"$error":"#N/A"}}]
[null,{"$f":"VLOOKUP(Formulas!$K26,Formulas!$A$2:$B$41,2,FALSE)","v":{"$error":"#N/A"}},{"$f":"VLOOKUP(Formulas!$K26,Formulas!$C$2:$D$41,2,FALSE)","v":{"$error":"#N/A"}},{"$f":"VLOOKUP(Formulas!$K26,Formulas!$E$2:$F$41,2,FALSE)","v":{"$error":"#N/A"}}]
[null,{"$f":"VLOOKUP(Formulas!$K27,Formulas!$A$2:$B$41,2,FALSE)","v":{"$error":"#N/A"}},{"$f":"VLOOKUP(Formulas!$K27,Formulas!$C$2:$D$41,2,FALSE)","v":{"$error":"#N/A"}},{"$f":"VLOOKUP(Formulas!$K27,Formulas!$E$2:$F$41,2,FALSE)","v":{"$error":"#N/A"}}]
[null,{"$f":"VLOOKUP(Formulas!$K28,Formulas!$A$2:$B$41,2,FALSE)","v":{"$error":"#N/A"}},{"$f":"VLOOKUP(Formulas!$K28,Formulas!$C$2:$D$41,2,FALSE)","v":{"$error":"#N/A"}},{"$f":"VLOOKUP(Formulas!$K28,Formulas!$E$2:$F$41,2,FALSE)","v":{"$error":"#N/A"}}]
[null,{"$f":"VLOOKUP(Formulas!$K29,Formulas!$A$2:$B$41,2,FALSE)","v":{"$error":"#N/A"}},{"$f":"VLOOKUP(Formulas!$K29,Formulas!$C$2:$D$41,2,FALSE)","v":{"$error":"#N/A"}},{"$f":"VLOOKUP(Formulas!$K29,Formulas!$E$2:$F$41,2,FALSE)","v":{"$error":"#N/A"}}]
[null,{"$f":"VLOOKUP(Formulas!$K30,Formulas!$A$2:$B$41,2,FALSE)","v":{"$error":"#N/A"}},{"$f":"VLOOKUP(Formulas!$K30,Formulas!$C$2:$D$41,2,FALSE)","v":{"$error":"#N/A"}},{"$f":"VLOOKUP(Formulas!$K30,Formulas!$E$2:$F$41,2,FALSE)","v":{"$error":"#N/A"}}]
[null,{"$f":"VLOOKUP(Formulas!$K31,Formulas!$A$2:$B$41,2,FALSE)","v":{"$error":"#N/A"}},{"$f":"VLOOKUP(Formulas!$K31,Formulas!$C$2:$D$41,2,FALSE)","v":{"$error":"#N/A"}},{"$f":"VLOOKUP(Formulas!$K31,Formulas!$E$2:$F$41,2,FALSE)","v":{"$error":"#N/A"}}]
[null,{"$f":"VLOOKUP(Formulas!$K32,Formulas!$A$2:$B$41,2,FALSE)","v":{"$error":"#N/A"}},{"$f":"VLOOKUP(Formulas!$K32,Formulas!$C$2:$D$41,2,FALSE)","v":{"$error":"#N/A"}},{"$f":"VLOOKUP(Formulas!$K32,Formulas!$E$2:$F$41,2,FALSE)","v":{"$error":"#N/A"}}]
[null,{"$f":"VLOOKUP(Formulas!$K33,Formulas!$A$2:$B$41,2,FALSE)","v":{"$error":"#N/A"}},{"$f":"VLOOKUP(Formulas!$K33,Formulas!$C$2:$D$41,2,FALSE)","v":{"$error":"#N/A"}},{"$f":"VLOOKUP(Formulas!$K33,Formulas!$E$2:$F$41,2,FALSE)","v":{"$error":"#N/A"}}]
[null,{"$f":"VLOOKUP(Formulas!$K34,Formulas!$A$2:$B$41,2,FALSE)","v":{"$error":"#N/A"}},{"$f":"VLOOKUP(Formulas!$K34,Formulas!$C$2:$D$41,2,FALSE)","v":{"$error":"#N/A"}},{"$f":"VLOOKUP(Formulas!$K34,Formulas!$E$2:$F$41,2,FALSE)","v":{"$error":"#N/A"}}]
[null,{"$f":"VLOOKUP(Formulas!$K35,Formulas!$A$2:$B$41,2,FALSE)","v":{"$error":"#N/A"}},{"$f":"VLOOKUP(Formulas!$K35,Formulas!$C$2:$D$41,2,FALSE)","v":{"$error":"#N/A"}},{"$f":"VLOOKUP(Formulas!$K35,Formulas!$E$2:$F$41,2,FALSE)","v":{"$error":"#N/A"}}]
[null,{"$f":"VLOOKUP(Formulas!$K36,Formulas!$A$2:$B$41,2,FALSE)","v":{"$error":"#N/A"}},{"$f":"VLOOKUP(Formulas!$K36,Formulas!$C$2:$D$41,2,FALSE)","v":{"$error":"#N/A"}},{"$f":"VLOOKUP(Formulas!$K36,Formulas!$E$2:$F$41,2,FALSE)","v":{"$error":"#N/A"}}]
[null,{"$f":"VLOOKUP(Formulas!$K37,Formulas!$A$2:$B$41,2,FALSE)","v":{"$error":"#N/A"}},{"$f":"VLOOKUP(Formulas!$K37,Formulas!$C$2:$D$41,2,FALSE)","v":{"$error":"#N/A"}},{"$f":"VLOOKUP(Formulas!$K37,Formulas!$E$2:$F$41,2,FALSE)","v":{"$error":"#N/A"}}]
[null,{"$f":"VLOOKUP(Formulas!$K38,Formulas!$A$2:$B$41,2,FALSE)","v":{"$error":"#N/A"}},{"$f":"VLOOKUP(Formulas!$K38,Formulas!$C$2:$D$41,2,FALSE)","v":{"$error":"#N/A"}},{"$f":"VLOOKUP(Formulas!$K38,Formulas!$E$2:$F$41,2,FALSE)","v":{"$error":"#N/A"}}]
[null,{"$f":"VLOOKUP(Formulas!$K39,Formulas!$A$2:$B$41,2,FALSE)","v":{"$error":"#N/A"}},{"$f":"VLOOKUP(Formulas!$K39,Formulas!$C$2:$D$41,2,FALSE)","v":{"$error":"#N/A"}},{"$f":"VLOOKUP(Formulas!$K39,Formulas!$E$2:$F$41,2,FALSE)","v":{"$error":"#N/A"}}]
[null,{"$f":"VLOOKUP(Formulas!$K40,Formulas!$A$2:$B$41,2,FALSE)","v":{"$error":"#N/A"}},{"$f":"VLOOKUP(Formulas!$K40,Formulas!$C$2:$D$41,2,FALSE)","v":{"$error":"#N/A"}},{"$f":"VLOOKUP(Formulas!$K40,Formulas!$E$2:$F$41,2,FALSE)","v":{"$error":"#N/A"}}]
[null,{"$f":"VLOOKUP(Formulas!$K41,Formulas!$A$2:$B$41,2,FALSE)","v":{"$error":"#N/A"}},{"$f":"VLOOKUP(Formulas!$K41,Formulas!$C$2:$D$41,2,FALSE)","v":{"$error":"#N/A"}},{"$f":"VLOOKUP(Formulas!$K41,Formulas!$E$2:$F$41,2,FALSE)","v":{"$error":"#N/A"}}]

{"sheet":"Alternate or Potential Members","index":5,"n_rows":6,"n_cols":37,"rows_kept":6,"cut":false,"hidden":false,"merged":[[1,12,1,32],[2,12,2,22],[2,23,2,32],[1,1,1,11]]}
[]
[null,"ALTERNATE or POTENTIAL BOARD MEMBERS",null,null,null,null,null,null,null,null,null,null,"Taken from \"CAPLAW Sample CAA Board Composition Matrix  April 2012\""]
[null,"Name","County ","Cell Phone","Home Phone","Address","Home city/ZIP code","Email","Sector","Level of Interest","Employer","Initial contact ","Skill/Experience/Expertise",null,null,null,null,null,null,null,null,null,null,"Access/Connections"]
[null,null,null,null,null,null,null,null,"Low income (L), Community (C),  or Private (P)","Scale of 1 to 5                                                                           \n  1=No interest             5=Very interested",null,"Date","  P.R. Communications","  Financial Planning/Management","  Organizational Management","  H.R. Management","  Fundraising","  Early childhood education & development","  Attorney",null,null,null,null,"  Foundations","  Wealthy Individuals","  Business/Corporations","  Politics/Government","  Religious Community","  Grassroots Constitutents",null,null,null,null,null,null,null,"L"]
[null,null,null,null,null,null,null,null,null,null,null,null,null,null,null,null,null,null,null,null,null,null,null,null,null,null,null,null,null,null,null,null,null,null,null,null,"C"]
[null,null,null,null,null,null,null,null,null,null,null,null,null,null,null,null,null,null,null,null,null,null,null,null,null,null,null,null,null,null,null,null,null,null,null,null,"P"]

{"sheet":"Committees","index":6,"n_rows":108,"n_cols":20,"rows_kept":108,"cut":false,"hidden":false,"merged":[[85,6,85,17],[106,6,106,17],[1,6,1,17],[22,6,22,17],[43,6,43,17],[64,6,64,17]]}
[]
[null,1,null,"STANDING COMMITTEE:","(ADD NAME)",null,"Attendance (Enter Date for each Committee Meeting)",null,null,null,null,null,null,null,null,null,null,null,null,"Yes"]
[null,"Committee Members"," Board member? ","Position ","Email Address",null,"Date","Date","Date","Date","Date","Date","Date","Date","Date","Date","Date","Date",null,"No"]
[]
[]
[]
[]
[]
[]
[]
[]
[]
[]
[]
[]
[]
[]
[]
[]
[]
[]
[]
[null,2,null,"STANDING COMMITTEE:","(ADD NAME)",null,"Attendance (Enter Date for each Committee Meeting)"]
[null,"Committee Members"," Board member? ","Position ","Email Address",null,"Date","Date","Date","Date","Date","Date","Date","Date","Date","Date","Date","Date"]
[]
[]
[]
[]
[]
[]
[]
[]
[]
[]
[]
[]
[]
[]
[]
[]
[]
[]
[]
[null,3,null,"STANDING COMMITTEE:","(ADD NAME)",null,"Attendance (Enter Date for each Committee Meeting)"]
[null,"Committee Members"," Board member? ","Position ","Email Address",null,"Date","Date","Date","Date","Date","Date","Date","Date","Date","Date","Date","Date"]
[]
[]
[]
[]
[]
[]
[]
[]
[]
[]
[]
[]
[]
[]
[]
[]
[]
[]
[]
[null,4,null,"STANDING COMMITTEE:","(ADD NAME)",null,"Attendance (Enter Date for each Committee Meeting)"]
[null,"Committee Members"," Board member? ","Position ","Email Address",null,"Date","Date","Date","Date","Date","Date","Date","Date","Date","Date","Date","Date"]
[]
[]
[]
[]
[]
[]
[]
[]
[]
[]
[]
[]
[]
[]
[]
[]
[]
[]
[]
[null,5,null,"STANDING COMMITTEE:","(ADD NAME)",null,"Attendance (Enter Date for each Committee Meeting)"]
[null,"Committee Members"," Board member? ","Position ","Email Address",null,"Date","Date","Date","Date","Date","Date","Date","Date","Date","Date","Date","Date"]
[]
[]
[]
[]
[]
[]
[]
[]
[]
[]
[]
[]
[]
[]
[]
[]
[]
[]
[]
[null,"(NUMBER)",null,"STANDING COMMITTEE:","(ADD NAME)",null,"Attendance (Enter Date for each Committee Meeting)"]
[null,"Committee Members"," Board member? ","Position ","Email Address",null,"Date","Date","Date","Date","Date","Date","Date","Date","Date","Date","Date","Date"]

{"sheet":"Trainings","index":7,"n_rows":9,"n_cols":13,"rows_kept":9,"cut":false,"hidden":false,"merged":[[1,1,1,7]]}
[]
[null,"BOARD ROLES & RESPONSIBILITIES TRAININGS"]
[null,"Training Name","Date of Training ","Topic","Method","Location","Hosted by","Total Attended"]
[]
[null,null,null,null,null,null,null,null,null,null,null,null,"Presenter "]
[null,null,null,null,null,null,null,null,null,null,null,null,"Meeting"]
[null,null,null,null,null,null,null,null,null,null,null,null,"Conference "]
[null,null,null,null,null,null,null,null,null,null,null,null,"Retreat "]
[null,null,null,null,null,null,null,null,null,null,null,null,"Other"]

{"sheet":"Formulas","index":8,"n_rows":83,"n_cols":17,"rows_kept":83,"cut":false,"hidden":true,"merged":[]}
[null,"L",null,"P",null,"C",null,null,null,null,null,null,null,null,null,null,"Y"]
[{"$f":"IF(B2=\"\",\"\",MAX(A$1:A1)+1)","v":""},{"$f":"IF(Detail!C5=\"Y\",IF(Detail!$E5=B$1,Detail!$B5,\"\"),\"\")","v":""},{"$f":"IF(D2=\"\",\"\",MAX(C$1:C1)+1)","v":""},{"$f":"IF(Detail!C5=\"Y\",IF(Detail!$E5=D$1,Detail!$B5,\"\"),\"\")","v":""},{"$f":"IF(F2=\"\",\"\",MAX(E$1:E1)+1)","v":""},{"$f":"IF(Detail!C5=\"Y\",IF(Detail!$E5=F$1,Detail!$B5,\"\"),\"\")","v":""},null,null,null,null,{"$f":"1","v":1},null,null,null,null,null,"N"]
[{"$f":"IF(B3=\"\",\"\",MAX(A$1:A2)+1)","v":""},{"$f":"IF(Detail!C6=\"Y\",IF(Detail!$E6=B$1,Detail!$B6,\"\"),\"\")","v":""},{"$f":"IF(D3=\"\",\"\",MAX(C$1:C2)+1)","v":""},{"$f":"IF(Detail!C6=\"Y\",IF(Detail!$E6=D$1,Detail!$B6,\"\"),\"\")","v":""},{"$f":"IF(F3=\"\",\"\",MAX(E$1:E2)+1)","v":""},{"$f":"IF(Detail!C6=\"Y\",IF(Detail!$E6=F$1,Detail!$B6,\"\"),\"\")","v":""},null,null,null,null,{"$f":"1+K2","v":2}]
[{"$f":"IF(B4=\"\",\"\",MAX(A$1:A3)+1)","v":""},{"$f":"IF(Detail!C7=\"Y\",IF(Detail!$E7=B$1,Detail!$B7,\"\"),\"\")","v":""},{"$f":"IF(D4=\"\",\"\",MAX(C$1:C3)+1)","v":""},{"$f":"IF(Detail!C7=\"Y\",IF(Detail!$E7=D$1,Detail!$B7,\"\"),\"\")","v":""},{"$f":"IF(F4=\"\",\"\",MAX(E$1:E3)+1)","v":""},{"$f":"IF(Detail!C7=\"Y\",IF(Detail!$E7=F$1,Detail!$B7,\"\"),\"\")","v":""},null,null,null,null,{"$f":"1+K3","v":3}]
[{"$f":"IF(B5=\"\",\"\",MAX(A$1:A4)+1)","v":""},{"$f":"IF(Detail!C8=\"Y\",IF(Detail!$E8=B$1,Detail!$B8,\"\"),\"\")","v":""},{"$f":"IF(D5=\"\",\"\",MAX(C$1:C4)+1)","v":""},{"$f":"IF(Detail!C8=\"Y\",IF(Detail!$E8=D$1,Detail!$B8,\"\"),\"\")","v":""},{"$f":"IF(F5=\"\",\"\",MAX(E$1:E4)+1)","v":""},{"$f":"IF(Detail!C8=\"Y\",IF(Detail!$E8=F$1,Detail!$B8,\"\"),\"\")","v":""},null,null,null,null,4]
[{"$f":"IF(B6=\"\",\"\",MAX(A$1:A5)+1)","v":""},{"$f":"IF(Detail!C9=\"Y\",IF(Detail!$E9=B$1,Detail!$B9,\"\"),\"\")","v":""},{"$f":"IF(D6=\"\",\"\",MAX(C$1:C5)+1)","v":""},{"$f":"IF(Detail!C9=\"Y\",IF(Detail!$E9=D$1,Detail!$B9,\"\"),\"\")","v":""},{"$f":"IF(F6=\"\",\"\",MAX(E$1:E5)+1)","v":""},{"$f":"IF(Detail!C9=\"Y\",IF(Detail!$E9=F$1,Detail!$B9,\"\"),\"\")","v":""},null,null,null,null,5]
[{"$f":"IF(B7=\"\",\"\",MAX(A$1:A6)+1)","v":""},{"$f":"IF(Detail!C10=\"Y\",IF(Detail!$E10=B$1,Detail!$B10,\"\"),\"\")","v":""},{"$f":"IF(D7=\"\",\"\",MAX(C$1:C6)+1)","v":""},{"$f":"IF(Detail!C10=\"Y\",IF(Detail!$E10=D$1,Detail!$B10,\"\"),\"\")","v":""},{"$f":"IF(F7=\"\",\"\",MAX(E$1:E6)+1)","v":""},{"$f":"IF(Detail!C10=\"Y\",IF(Detail!$E10=F$1,Detail!$B10,\"\"),\"\")","v":""},null,null,null,null,6]
[{"$f":"IF(B8=\"\",\"\",MAX(A$1:A7)+1)","v":""},{"$f":"IF(Detail!C11=\"Y\",IF(Detail!$E11=B$1,Detail!$B11,\"\"),\"\")","v":""},{"$f":"IF(D8=\"\",\"\",MAX(C$1:C7)+1)","v":""},{"$f":"IF(Detail!C11=\"Y\",IF(Detail!$E11=D$1,Detail!$B11,\"\"),\"\")","v":""},{"$f":"IF(F8=\"\",\"\",MAX(E$1:E7)+1)","v":""},{"$f":"IF(Detail!C11=\"Y\",IF(Detail!$E11=F$1,Detail!$B11,\"\"),\"\")","v":""},null,null,null,null,7]
[{"$f":"IF(B9=\"\",\"\",MAX(A$1:A8)+1)","v":""},{"$f":"IF(Detail!C12=\"Y\",IF(Detail!$E12=B$1,Detail!$B12,\"\"),\"\")","v":""},{"$f":"IF(D9=\"\",\"\",MAX(C$1:C8)+1)","v":""},{"$f":"IF(Detail!C12=\"Y\",IF(Detail!$E12=D$1,Detail!$B12,\"\"),\"\")","v":""},{"$f":"IF(F9=\"\",\"\",MAX(E$1:E8)+1)","v":""},{"$f":"IF(Detail!C12=\"Y\",IF(Detail!$E12=F$1,Detail!$B12,\"\"),\"\")","v":""},null,null,null,null,8]
[{"$f":"IF(B10=\"\",\"\",MAX(A$1:A9)+1)","v":""},{"$f":"IF(Detail!C13=\"Y\",IF(Detail!$E13=B$1,Detail!$B13,\"\"),\"\")","v":""},{"$f":"IF(D10=\"\",\"\",MAX(C$1:C9)+1)","v":""},{"$f":"IF(Detail!C13=\"Y\",IF(Detail!$E13=D$1,Detail!$B13,\"\"),\"\")","v":""},{"$f":"IF(F10=\"\",\"\",MAX(E$1:E9)+1)","v":""},{"$f":"IF(Detail!C13=\"Y\",IF(Detail!$E13=F$1,Detail!$B13,\"\"),\"\")","v":""},null,null,null,null,9]
[{"$f":"IF(B11=\"\",\"\",MAX(A$1:A10)+1)","v":""},{"$f":"IF(Detail!C14=\"Y\",IF(Detail!$E14=B$1,Detail!$B14,\"\"),\"\")","v":""},{"$f":"IF(D11=\"\",\"\",MAX(C$1:C10)+1)","v":""},{"$f":"IF(Detail!C14=\"Y\",IF(Detail!$E14=D$1,Detail!$B14,\"\"),\"\")","v":""},{"$f":"IF(F11=\"\",\"\",MAX(E$1:E10)+1)","v":""},{"$f":"IF(Detail!C14=\"Y\",IF(Detail!$E14=F$1,Detail!$B14,\"\"),\"\")","v":""},null,null,null,null,10]
[{"$f":"IF(B12=\"\",\"\",MAX(A$1:A11)+1)","v":""},{"$f":"IF(Detail!C15=\"Y\",IF(Detail!$E15=B$1,Detail!$B15,\"\"),\"\")","v":""},{"$f":"IF(D12=\"\",\"\",MAX(C$1:C11)+1)","v":""},{"$f":"IF(Detail!C15=\"Y\",IF(Detail!$E15=D$1,Detail!$B15,\"\"),\"\")","v":""},{"$f":"IF(F12=\"\",\"\",MAX(E$1:E11)+1)","v":""},{"$f":"IF(Detail!C15=\"Y\",IF(Detail!$E15=F$1,Detail!$B15,\"\"),\"\")","v":""},null,null,null,null,11]
[{"$f":"IF(B13=\"\",\"\",MAX(A$1:A12)+1)","v":""},{"$f":"IF(Detail!C16=\"Y\",IF(Detail!$E16=B$1,Detail!$B16,\"\"),\"\")","v":""},{"$f":"IF(D13=\"\",\"\",MAX(C$1:C12)+1)","v":""},{"$f":"IF(Detail!C16=\"Y\",IF(Detail!$E16=D$1,Detail!$B16,\"\"),\"\")","v":""},{"$f":"IF(F13=\"\",\"\",MAX(E$1:E12)+1)","v":""},{"$f":"IF(Detail!C16=\"Y\",IF(Detail!$E16=F$1,Detail!$B16,\"\"),\"\")","v":""},null,null,null,null,12]
[{"$f":"IF(B14=\"\",\"\",MAX(A$1:A13)+1)","v":""},{"$f":"IF(Detail!C17=\"Y\",IF(Detail!$E17=B$1,Detail!$B17,\"\"),\"\")","v":""},{"$f":"IF(D14=\"\",\"\",MAX(C$1:C13)+1)","v":""},{"$f":"IF(Detail!C17=\"Y\",IF(Detail!$E17=D$1,Detail!$B17,\"\"),\"\")","v":""},{"$f":"IF(F14=\"\",\"\",MAX(E$1:E13)+1)","v":""},{"$f":"IF(Detail!C17=\"Y\",IF(Detail!$E17=F$1,Detail!$B17,\"\"),\"\")","v":""},null,null,null,null,13]
[{"$f":"IF(B15=\"\",\"\",MAX(A$1:A14)+1)","v":""},{"$f":"IF(Detail!C18=\"Y\",IF(Detail!$E18=B$1,Detail!$B18,\"\"),\"\")","v":""},{"$f":"IF(D15=\"\",\"\",MAX(C$1:C14)+1)","v":""},{"$f":"IF(Detail!C18=\"Y\",IF(Detail!$E18=D$1,Detail!$B18,\"\"),\"\")","v":""},{"$f":"IF(F15=\"\",\"\",MAX(E$1:E14)+1)","v":""},{"$f":"IF(Detail!C18=\"Y\",IF(Detail!$E18=F$1,Detail!$B18,\"\"),\"\")","v":""},null,null,null,null,14]
[{"$f":"IF(B16=\"\",\"\",MAX(A$1:A15)+1)","v":""},{"$f":"IF(Detail!C19=\"Y\",IF(Detail!$E19=B$1,Detail!$B19,\"\"),\"\")","v":""},{"$f":"IF(D16=\"\",\"\",MAX(C$1:C15)+1)","v":""},{"$f":"IF(Detail!C19=\"Y\",IF(Detail!$E19=D$1,Detail!$B19,\"\"),\"\")","v":""},{"$f":"IF(F16=\"\",\"\",MAX(E$1:E15)+1)","v":""},{"$f":"IF(Detail!C19=\"Y\",IF(Detail!$E19=F$1,Detail!$B19,\"\"),\"\")","v":""},null,null,null,null,15]
[{"$f":"IF(B17=\"\",\"\",MAX(A$1:A16)+1)","v":""},{"$f":"IF(Detail!C20=\"Y\",IF(Detail!$E20=B$1,Detail!$B20,\"\"),\"\")","v":""},{"$f":"IF(D17=\"\",\"\",MAX(C$1:C16)+1)","v":""},{"$f":"IF(Detail!C20=\"Y\",IF(Detail!$E20=D$1,Detail!$B20,\"\"),\"\")","v":""},{"$f":"IF(F17=\"\",\"\",MAX(E$1:E16)+1)","v":""},{"$f":"IF(Detail!C20=\"Y\",IF(Detail!$E20=F$1,Detail!$B20,\"\"),\"\")","v":""},null,null,null,null,16]
[{"$f":"IF(B18=\"\",\"\",MAX(A$1:A17)+1)","v":""},{"$f":"IF(Detail!C21=\"Y\",IF(Detail!$E21=B$1,Detail!$B21,\"\"),\"\")","v":""},{"$f":"IF(D18=\"\",\"\",MAX(C$1:C17)+1)","v":""},{"$f":"IF(Detail!C21=\"Y\",IF(Detail!$E21=D$1,Detail!$B21,\"\"),\"\")","v":""},{"$f":"IF(F18=\"\",\"\",MAX(E$1:E17)+1)","v":""},{"$f":"IF(Detail!C21=\"Y\",IF(Detail!$E21=F$1,Detail!$B21,\"\"),\"\")","v":""},null,null,null,null,17]
[{"$f":"IF(B19=\"\",\"\",MAX(A$1:A18)+1)","v":""},{"$f":"IF(Detail!C22=\"Y\",IF(Detail!$E22=B$1,Detail!$B22,\"\"),\"\")","v":""},{"$f":"IF(D19=\"\",\"\",MAX(C$1:C18)+1)","v":""},{"$f":"IF(Detail!C22=\"Y\",IF(Detail!$E22=D$1,Detail!$B22,\"\"),\"\")","v":""},{"$f":"IF(F19=\"\",\"\",MAX(E$1:E18)+1)","v":""},{"$f":"IF(Detail!C22=\"Y\",IF(Detail!$E22=F$1,Detail!$B22,\"\"),\"\")","v":""},null,null,null,null,18]
[{"$f":"IF(B20=\"\",\"\",MAX(A$1:A19)+1)","v":""},{"$f":"IF(Detail!C23=\"Y\",IF(Detail!$E23=B$1,Detail!$B23,\"\"),\"\")","v":""},{"$f":"IF(D20=\"\",\"\",MAX(C$1:C19)+1)","v":""},{"$f":"IF(Detail!C23=\"Y\",IF(Detail!$E23=D$1,Detail!$B23,\"\"),\"\")","v":""},{"$f":"IF(F20=\"\",\"\",MAX(E$1:E19)+1)","v":""},{"$f":"IF(Detail!C23=\"Y\",IF(Detail!$E23=F$1,Detail!$B23,\"\"),\"\")","v":""},null,null,null,null,19]
[{"$f":"IF(B21=\"\",\"\",MAX(A$1:A20)+1)","v":""},{"$f":"IF(Detail!C24=\"Y\",IF(Detail!$E24=B$1,Detail!$B24,\"\"),\"\")","v":""},{"$f":"IF(D21=\"\",\"\",MAX(C$1:C20)+1)","v":""},{"$f":"IF(Detail!C24=\"Y\",IF(Detail!$E24=D$1,Detail!$B24,\"\"),\"\")","v":""},{"$f":"IF(F21=\"\",\"\",MAX(E$1:E20)+1)","v":""},{"$f":"IF(Detail!C24=\"Y\",IF(Detail!$E24=F$1,Detail!$B24,\"\"),\"\")","v":""},null,null,null,null,20]
[{"$f":"IF(B22=\"\",\"\",MAX(A$1:A21)+1)","v":""},{"$f":"IF(Detail!C25=\"Y\",IF(Detail!$E25=B$1,Detail!$B25,\"\"),\"\")","v":""},{"$f":"IF(D22=\"\",\"\",MAX(C$1:C21)+1)","v":""},{"$f":"IF(Detail!C25=\"Y\",IF(Detail!$E25=D$1,Detail!$B25,\"\"),\"\")","v":""},{"$f":"IF(F22=\"\",\"\",MAX(E$1:E21)+1)","v":""},{"$f":"IF(Detail!C25=\"Y\",IF(Detail!$E25=F$1,Detail!$B25,\"\"),\"\")","v":""},null,null,null,null,21]
[{"$f":"IF(B23=\"\",\"\",MAX(A$1:A22)+1)","v":""},{"$f":"IF(Detail!C26=\"Y\",IF(Detail!$E26=B$1,Detail!$B26,\"\"),\"\")","v":""},{"$f":"IF(D23=\"\",\"\",MAX(C$1:C22)+1)","v":""},{"$f":"IF(Detail!C26=\"Y\",IF(Detail!$E26=D$1,Detail!$B26,\"\"),\"\")","v":""},{"$f":"IF(F23=\"\",\"\",MAX(E$1:E22)+1)","v":""},{"$f":"IF(Detail!C26=\"Y\",IF(Detail!$E26=F$1,Detail!$B26,\"\"),\"\")","v":""},null,null,null,null,22]
[{"$f":"IF(B24=\"\",\"\",MAX(A$1:A23)+1)","v":""},{"$f":"IF(Detail!C27=\"Y\",IF(Detail!$E27=B$1,Detail!$B27,\"\"),\"\")","v":""},{"$f":"IF(D24=\"\",\"\",MAX(C$1:C23)+1)","v":""},{"$f":"IF(Detail!C27=\"Y\",IF(Detail!$E27=D$1,Detail!$B27,\"\"),\"\")","v":""},{"$f":"IF(F24=\"\",\"\",MAX(E$1:E23)+1)","v":""},{"$f":"IF(Detail!C27=\"Y\",IF(Detail!$E27=F$1,Detail!$B27,\"\"),\"\")","v":""},null,null,null,null,23]
[{"$f":"IF(B25=\"\",\"\",MAX(A$1:A24)+1)","v":""},{"$f":"IF(Detail!C28=\"Y\",IF(Detail!$E28=B$1,Detail!$B28,\"\"),\"\")","v":""},{"$f":"IF(D25=\"\",\"\",MAX(C$1:C24)+1)","v":""},{"$f":"IF(Detail!C28=\"Y\",IF(Detail!$E28=D$1,Detail!$B28,\"\"),\"\")","v":""},{"$f":"IF(F25=\"\",\"\",MAX(E$1:E24)+1)","v":""},{"$f":"IF(Detail!C28=\"Y\",IF(Detail!$E28=F$1,Detail!$B28,\"\"),\"\")","v":""},null,null,null,null,24]
[{"$f":"IF(B26=\"\",\"\",MAX(A$1:A25)+1)","v":""},{"$f":"IF(Detail!C29=\"Y\",IF(Detail!$E29=B$1,Detail!$B29,\"\"),\"\")","v":""},{"$f":"IF(D26=\"\",\"\",MAX(C$1:C25)+1)","v":""},{"$f":"IF(Detail!C29=\"Y\",IF(Detail!$E29=D$1,Detail!$B29,\"\"),\"\")","v":""},{"$f":"IF(F26=\"\",\"\",MAX(E$1:E25)+1)","v":""},{"$f":"IF(Detail!C29=\"Y\",IF(Detail!$E29=F$1,Detail!$B29,\"\"),\"\")","v":""},null,null,null,null,25]
[{"$f":"IF(B27=\"\",\"\",MAX(A$1:A26)+1)","v":""},{"$f":"IF(Detail!C30=\"Y\",IF(Detail!$E30=B$1,Detail!$B30,\"\"),\"\")","v":""},{"$f":"IF(D27=\"\",\"\",MAX(C$1:C26)+1)","v":""},{"$f":"IF(Detail!C30=\"Y\",IF(Detail!$E30=D$1,Detail!$B30,\"\"),\"\")","v":""},{"$f":"IF(F27=\"\",\"\",MAX(E$1:E26)+1)","v":""},{"$f":"IF(Detail!C30=\"Y\",IF(Detail!$E30=F$1,Detail!$B30,\"\"),\"\")","v":""},null,null,null,null,26]
[{"$f":"IF(B28=\"\",\"\",MAX(A$1:A27)+1)","v":""},{"$f":"IF(Detail!C31=\"Y\",IF(Detail!$E31=B$1,Detail!$B31,\"\"),\"\")","v":""},{"$f":"IF(D28=\"\",\"\",MAX(C$1:C27)+1)","v":""},{"$f":"IF(Detail!C31=\"Y\",IF(Detail!$E31=D$1,Detail!$B31,\"\"),\"\")","v":""},{"$f":"IF(F28=\"\",\"\",MAX(E$1:E27)+1)","v":""},{"$f":"IF(Detail!C31=\"Y\",IF(Detail!$E31=F$1,Detail!$B31,\"\"),\"\")","v":""},null,null,null,null,27]
[{"$f":"IF(B29=\"\",\"\",MAX(A$1:A28)+1)","v":""},{"$f":"IF(Detail!C32=\"Y\",IF(Detail!$E32=B$1,Detail!$B32,\"\"),\"\")","v":""},{"$f":"IF(D29=\"\",\"\",MAX(C$1:C28)+1)","v":""},{"$f":"IF(Detail!C32=\"Y\",IF(Detail!$E32=D$1,Detail!$B32,\"\"),\"\")","v":""},{"$f":"IF(F29=\"\",\"\",MAX(E$1:E28)+1)","v":""},{"$f":"IF(Detail!C32=\"Y\",IF(Detail!$E32=F$1,Detail!$B32,\"\"),\"\")","v":""},null,null,null,null,28]
[{"$f":"IF(B30=\"\",\"\",MAX(A$1:A29)+1)","v":""},{"$f":"IF(Detail!C33=\"Y\",IF(Detail!$E33=B$1,Detail!$B33,\"\"),\"\")","v":""},{"$f":"IF(D30=\"\",\"\",MAX(C$1:C29)+1)","v":""},{"$f":"IF(Detail!C33=\"Y\",IF(Detail!$E33=D$1,Detail!$B33,\"\"),\"\")","v":""},{"$f":"IF(F30=\"\",\"\",MAX(E$1:E29)+1)","v":""},{"$f":"IF(Detail!C33=\"Y\",IF(Detail!$E33=F$1,Detail!$B33,\"\"),\"\")","v":""},null,null,null,null,29]
[{"$f":"IF(B31=\"\",\"\",MAX(A$1:A30)+1)","v":""},{"$f":"IF(Detail!C34=\"Y\",IF(Detail!$E34=B$1,Detail!$B34,\"\"),\"\")","v":""},{"$f":"IF(D31=\"\",\"\",MAX(C$1:C30)+1)","v":""},{"$f":"IF(Detail!C34=\"Y\",IF(Detail!$E34=D$1,Detail!$B34,\"\"),\"\")","v":""},{"$f":"IF(F31=\"\",\"\",MAX(E$1:E30)+1)","v":""},{"$f":"IF(Detail!C34=\"Y\",IF(Detail!$E34=F$1,Detail!$B34,\"\"),\"\")","v":""},null,null,null,null,30]
[{"$f":"IF(B32=\"\",\"\",MAX(A$1:A31)+1)","v":""},{"$f":"IF(Detail!C35=\"Y\",IF(Detail!$E35=B$1,Detail!$B35,\"\"),\"\")","v":""},{"$f":"IF(D32=\"\",\"\",MAX(C$1:C31)+1)","v":""},{"$f":"IF(Detail!C35=\"Y\",IF(Detail!$E35=D$1,Detail!$B35,\"\"),\"\")","v":""},{"$f":"IF(F32=\"\",\"\",MAX(E$1:E31)+1)","v":""},{"$f":"IF(Detail!C35=\"Y\",IF(Detail!$E35=F$1,Detail!$B35,\"\"),\"\")","v":""},null,null,null,null,31]
[{"$f":"IF(B33=\"\",\"\",MAX(A$1:A32)+1)","v":""},{"$f":"IF(Detail!C36=\"Y\",IF(Detail!$E36=B$1,Detail!$B36,\"\"),\"\")","v":""},{"$f":"IF(D33=\"\",\"\",MAX(C$1:C32)+1)","v":""},{"$f":"IF(Detail!C36=\"Y\",IF(Detail!$E36=D$1,Detail!$B36,\"\"),\"\")","v":""},{"$f":"IF(F33=\"\",\"\",MAX(E$1:E32)+1)","v":""},{"$f":"IF(Detail!C36=\"Y\",IF(Detail!$E36=F$1,Detail!$B36,\"\"),\"\")","v":""},null,null,null,null,32]
[{"$f":"IF(B34=\"\",\"\",MAX(A$1:A33)+1)","v":""},{"$f":"IF(Detail!C37=\"Y\",IF(Detail!$E37=B$1,Detail!$B37,\"\"),\"\")","v":""},{"$f":"IF(D34=\"\",\"\",MAX(C$1:C33)+1)","v":""},{"$f":"IF(Detail!C37=\"Y\",IF(Detail!$E37=D$1,Detail!$B37,\"\"),\"\")","v":""},{"$f":"IF(F34=\"\",\"\",MAX(E$1:E33)+1)","v":""},{"$f":"IF(Detail!C37=\"Y\",IF(Detail!$E37=F$1,Detail!$B37,\"\"),\"\")","v":""},null,null,null,null,33]
[{"$f":"IF(B35=\"\",\"\",MAX(A$1:A34)+1)","v":""},{"$f":"IF(Detail!C38=\"Y\",IF(Detail!$E38=B$1,Detail!$B38,\"\"),\"\")","v":""},{"$f":"IF(D35=\"\",\"\",MAX(C$1:C34)+1)","v":""},{"$f":"IF(Detail!C38=\"Y\",IF(Detail!$E38=D$1,Detail!$B38,\"\"),\"\")","v":""},{"$f":"IF(F35=\"\",\"\",MAX(E$1:E34)+1)","v":""},{"$f":"IF(Detail!C38=\"Y\",IF(Detail!$E38=F$1,Detail!$B38,\"\"),\"\")","v":""},null,null,null,null,34]
[{"$f":"IF(B36=\"\",\"\",MAX(A$1:A35)+1)","v":""},{"$f":"IF(Detail!C39=\"Y\",IF(Detail!$E39=B$1,Detail!$B39,\"\"),\"\")","v":""},{"$f":"IF(D36=\"\",\"\",MAX(C$1:C35)+1)","v":""},{"$f":"IF(Detail!C39=\"Y\",IF(Detail!$E39=D$1,Detail!$B39,\"\"),\"\")","v":""},{"$f":"IF(F36=\"\",\"\",MAX(E$1:E35)+1)","v":""},{"$f":"IF(Detail!C39=\"Y\",IF(Detail!$E39=F$1,Detail!$B39,\"\"),\"\")","v":""},null,null,null,null,35]
[{"$f":"IF(B37=\"\",\"\",MAX(A$1:A36)+1)","v":""},{"$f":"IF(Detail!C40=\"Y\",IF(Detail!$E40=B$1,Detail!$B40,\"\"),\"\")","v":""},{"$f":"IF(D37=\"\",\"\",MAX(C$1:C36)+1)","v":""},{"$f":"IF(Detail!C40=\"Y\",IF(Detail!$E40=D$1,Detail!$B40,\"\"),\"\")","v":""},{"$f":"IF(F37=\"\",\"\",MAX(E$1:E36)+1)","v":""},{"$f":"IF(Detail!C40=\"Y\",IF(Detail!$E40=F$1,Detail!$B40,\"\"),\"\")","v":""},null,null,null,null,36]
[{"$f":"IF(B38=\"\",\"\",MAX(A$1:A37)+1)","v":""},{"$f":"IF(Detail!C41=\"Y\",IF(Detail!$E41=B$1,Detail!$B41,\"\"),\"\")","v":""},{"$f":"IF(D38=\"\",\"\",MAX(C$1:C37)+1)","v":""},{"$f":"IF(Detail!C41=\"Y\",IF(Detail!$E41=D$1,Detail!$B41,\"\"),\"\")","v":""},{"$f":"IF(F38=\"\",\"\",MAX(E$1:E37)+1)","v":""},{"$f":"IF(Detail!C41=\"Y\",IF(Detail!$E41=F$1,Detail!$B41,\"\"),\"\")","v":""},null,null,null,null,37]
[{"$f":"IF(B39=\"\",\"\",MAX(A$1:A38)+1)","v":""},{"$f":"IF(Detail!C42=\"Y\",IF(Detail!$E42=B$1,Detail!$B42,\"\"),\"\")","v":""},{"$f":"IF(D39=\"\",\"\",MAX(C$1:C38)+1)","v":""},{"$f":"IF(Detail!C42=\"Y\",IF(Detail!$E42=D$1,Detail!$B42,\"\"),\"\")","v":""},{"$f":"IF(F39=\"\",\"\",MAX(E$1:E38)+1)","v":""},{"$f":"IF(Detail!C42=\"Y\",IF(Detail!$E42=F$1,Detail!$B42,\"\"),\"\")","v":""},null,null,null,null,38]
[{"$f":"IF(B40=\"\",\"\",MAX(A$1:A39)+1)","v":""},{"$f":"IF(Detail!C43=\"Y\",IF(Detail!$E43=B$1,Detail!$B43,\"\"),\"\")","v":""},{"$f":"IF(D40=\"\",\"\",MAX(C$1:C39)+1)","v":""},{"$f":"IF(Detail!C43=\"Y\",IF(Detail!$E43=D$1,Detail!$B43,\"\"),\"\")","v":""},{"$f":"IF(F40=\"\",\"\",MAX(E$1:E39)+1)","v":""},{"$f":"IF(Detail!C43=\"Y\",IF(Detail!$E43=F$1,Detail!$B43,\"\"),\"\")","v":""},null,null,null,null,39]
[{"$f":"IF(B41=\"\",\"\",MAX(A$1:A40)+1)","v":""},{"$f":"IF(Detail!C44=\"Y\",IF(Detail!$E44=B$1,Detail!$B44,\"\"),\"\")","v":""},{"$f":"IF(D41=\"\",\"\",MAX(C$1:C40)+1)","v":""},{"$f":"IF(Detail!C44=\"Y\",IF(Detail!$E44=D$1,Detail!$B44,\"\"),\"\")","v":""},{"$f":"IF(F41=\"\",\"\",MAX(E$1:E40)+1)","v":""},{"$f":"IF(Detail!C44=\"Y\",IF(Detail!$E44=F$1,Detail!$B44,\"\"),\"\")","v":""},null,null,null,null,40]
[{"$f":"IF(Detail!E46=\"l\",Detail!B46,\"\")","v":""}]
[]
[]
[]
[]
[]
[]
[]
[]
[]
[]
[{"$f":"IF(ISBLANK(Detail!B12),\"\",DATE(YEAR(Detail!N12)+Detail!O12,MONTH(Detail!N12),DAY(Detail!N12)))","v":""}]
[{"$f":"IF(ISBLANK(Detail!B13),\"\",DATE(YEAR(Detail!N13)+Detail!O13,MONTH(Detail!N13),DAY(Detail!N13)))","v":""}]
[{"$f":"IF(ISBLANK(Detail!B14),\"\",DATE(YEAR(Detail!N14)+Detail!O14,MONTH(Detail!N14),DAY(Detail!N14)))","v":""}]
[{"$f":"IF(ISBLANK(Detail!B15),\"\",DATE(YEAR(Detail!N15)+Detail!O15,MONTH(Detail!N15),DAY(Detail!N15)))","v":""}]
[{"$f":"IF(ISBLANK(Detail!B16),\"\",DATE(YEAR(Detail!N16)+Detail!O16,MONTH(Detail!N16),DAY(Detail!N16)))","v":""}]
[{"$f":"IF(ISBLANK(Detail!B17),\"\",DATE(YEAR(Detail!N17)+Detail!O17,MONTH(Detail!N17),DAY(Detail!N17)))","v":""}]
[{"$f":"IF(ISBLANK(Detail!B18),\"\",DATE(YEAR(Detail!N18)+Detail!O18,MONTH(Detail!N18),DAY(Detail!N18)))","v":""}]
[{"$f":"IF(ISBLANK(Detail!B19),\"\",DATE(YEAR(Detail!N19)+Detail!O19,MONTH(Detail!N19),DAY(Detail!N19)))","v":""}]
[{"$f":"IF(ISBLANK(Detail!B20),\"\",DATE(YEAR(Detail!N20)+Detail!O20,MONTH(Detail!N20),DAY(Detail!N20)))","v":""}]
[{"$f":"IF(ISBLANK(Detail!B21),\"\",DATE(YEAR(Detail!N21)+Detail!O21,MONTH(Detail!N21),DAY(Detail!N21)))","v":""}]
[{"$f":"IF(ISBLANK(Detail!B22),\"\",DATE(YEAR(Detail!N22)+Detail!O22,MONTH(Detail!N22),DAY(Detail!N22)))","v":""}]
[{"$f":"IF(ISBLANK(Detail!B23),\"\",DATE(YEAR(Detail!N23)+Detail!O23,MONTH(Detail!N23),DAY(Detail!N23)))","v":""}]
[{"$f":"IF(ISBLANK(Detail!B24),\"\",DATE(YEAR(Detail!N24)+Detail!O24,MONTH(Detail!N24),DAY(Detail!N24)))","v":""}]
[{"$f":"IF(ISBLANK(Detail!B25),\"\",DATE(YEAR(Detail!N25)+Detail!O25,MONTH(Detail!N25),DAY(Detail!N25)))","v":""}]
[{"$f":"IF(ISBLANK(Detail!B26),\"\",DATE(YEAR(Detail!N26)+Detail!O26,MONTH(Detail!N26),DAY(Detail!N26)))","v":""}]
[{"$f":"IF(ISBLANK(Detail!B27),\"\",DATE(YEAR(Detail!N27)+Detail!O27,MONTH(Detail!N27),DAY(Detail!N27)))","v":""}]
[{"$f":"IF(ISBLANK(Detail!B28),\"\",DATE(YEAR(Detail!N28)+Detail!O28,MONTH(Detail!N28),DAY(Detail!N28)))","v":""}]
[{"$f":"IF(ISBLANK(Detail!B29),\"\",DATE(YEAR(Detail!N29)+Detail!O29,MONTH(Detail!N29),DAY(Detail!N29)))","v":""}]
[{"$f":"IF(ISBLANK(Detail!B30),\"\",DATE(YEAR(Detail!N30)+Detail!O30,MONTH(Detail!N30),DAY(Detail!N30)))","v":""}]
[{"$f":"IF(ISBLANK(Detail!B31),\"\",DATE(YEAR(Detail!N31)+Detail!O31,MONTH(Detail!N31),DAY(Detail!N31)))","v":""}]
[{"$f":"IF(ISBLANK(Detail!B32),\"\",DATE(YEAR(Detail!N32)+Detail!O32,MONTH(Detail!N32),DAY(Detail!N32)))","v":""}]
[{"$f":"IF(ISBLANK(Detail!B33),\"\",DATE(YEAR(Detail!N33)+Detail!O33,MONTH(Detail!N33),DAY(Detail!N33)))","v":""}]
[{"$f":"IF(ISBLANK(Detail!B34),\"\",DATE(YEAR(Detail!N34)+Detail!O34,MONTH(Detail!N34),DAY(Detail!N34)))","v":""}]
[{"$f":"IF(ISBLANK(Detail!B35),\"\",DATE(YEAR(Detail!N35)+Detail!O35,MONTH(Detail!N35),DAY(Detail!N35)))","v":""}]
[{"$f":"IF(ISBLANK(Detail!B36),\"\",DATE(YEAR(Detail!N36)+Detail!O36,MONTH(Detail!N36),DAY(Detail!N36)))","v":""}]
[{"$f":"IF(ISBLANK(Detail!B39),\"\",DATE(YEAR(Detail!N39)+Detail!O39,MONTH(Detail!N39),DAY(Detail!N39)))","v":""}]
[{"$f":"IF(ISBLANK(Detail!B40),\"\",DATE(YEAR(Detail!N40)+Detail!O40,MONTH(Detail!N40),DAY(Detail!N40)))","v":""}]
[{"$f":"IF(ISBLANK(Detail!B41),\"\",DATE(YEAR(Detail!N41)+Detail!O41,MONTH(Detail!N41),DAY(Detail!N41)))","v":""}]
[{"$f":"IF(ISBLANK(Detail!B42),\"\",DATE(YEAR(Detail!N42)+Detail!O42,MONTH(Detail!N42),DAY(Detail!N42)))","v":""}]
[{"$f":"IF(ISBLANK(Detail!B43),\"\",DATE(YEAR(Detail!N43)+Detail!O43,MONTH(Detail!N43),DAY(Detail!N43)))","v":""}]
[{"$f":"IF(ISBLANK(Detail!B44),\"\",DATE(YEAR(Detail!N44)+Detail!O44,MONTH(Detail!N44),DAY(Detail!N44)))","v":""}]