{"text_format":"1","workbook":"xlsx","n_sheets":6,"sheets":["Data Entry Sheet","Dymo 450 Rack Labels","Dymo 450 Lead-In Labels","Dymo 450 Cabinet Labels","Form Setup","Rack Layout"],"not_rendered":{"charts":0,"images":13,"macros":1,"external_links":0,"defined_names":5,"comments":0,"pivot_tables":0},"unopened":[],"bounds":{"document_bytes":16777216,"sheet_cells":100000,"rows_first":2000,"rows_last":500,"rows_between":2000,"halvings":0,"cell_chars":16384,"cell_head_chars":4096},"cells_cut":0,"cells_raw":0,"read":"whole","date_system":"1900"}

{"sheet":"Data Entry Sheet","index":0,"n_rows":80,"n_cols":66,"rows_kept":80,"cut":false,"hidden":false,"merged":[[14,13,14,20]]}
[null,null,null,null,"Loop Tagging Table Work Sheet",null,null,null,null,null,null,null,null,null,"Rev. 1.78",null,null,null,null,null,null,null,null,null,null,null,null,null,null,null,null,null,null,null,null,null,null,null,null,null,null,null,null,null,null,null,null,null,null,null,null,"=IF(I17 = \"C\", B17+2,\"\")"]
[]
[null,"1.  Enter the Loop Tagging information from Loop Tagging Table on the design plan.  "]
[null,"2.  Add the Loop No and C (for Counting).  The Count No will be set two numbers higher than the Loop No but may be changed if needed."]
[null,"3.  When complete click the \"Sort Loop Tagging Table\" button "]
[null,"4.  Print Detailed Loop Tagging Table, Detector Rack and Loop Lead-in Labels"]
[null,"*** Each Loop Panel shall be labeled with it's coresponding Loop Nos (1-16); (17-32); (33-48); (49-64) along with each individual Loop No"]
[null,"*** Each Detector Rack shall be labeled with it's coresponding Detector Channels (1-16); (17-32); (33-48); (49-64) along with the Loop tag information"]
[]
[null,null,null,null,null,null,null,"Date Effective:"]
[null,"Comm No:"]
[null,"Intersection:"]
[null,"Main Street Ref:"]
[null,"Loop Tagging Table",null,null,null,null,null,null,null,null,null,null,null,null,null,null,null,null,null,null,null,null,"Detailed Loop Tagging Table",null,null,null,null,null,null,{"$f":"E11 & \"; \" & E12 & \"; \" & B13 & \" \" & E13","v":"; ; Main Street Ref: "}]
["Ref #","Loop No   or Channel","-","Direction","Lane","Phase","-","Loops","C","-","C #","Lead-in and Rack Labels",null,"Detection Channel Status                                 Provides an indication of the number of times a detection channel number is used",null,null,null,null,null,null,null,null,"Loop No or Channel","-","Direction","Lane","Phase","-","Loops","C","-","C #","Lead-in and Rack Labels",null,"Loop No","-","Direction","Lane","Phase","-","Loops","C","-","C #","Lead-in and Rack Labels",null,null,null,null,"Importable Loop Tagging Table",null,null,null,null,null,null,"Importable Loop Tags",null,null,null,"Loop No and Count No","Direction","Lane","Loops","Counting","Phase"]
[]
[1,null,{"$f":"IF(D17=0,\" \",\"-\")","v":" "},null,null,null,{"$f":"IF(H17=\"\",\"\",\"-\")","v":""},null,null,{"$f":"IF(I17=\"C\",\"-\",\" \")","v":" "},{"$f":"IF(I17 = \"C\", B17+2,\"\")","v":""},{"$f":"B17&C17&D17&E17&F17&G17&H17&\" \"&I17&J17&K17","v":"   "},null,1,{"$f":"IF((COUNTIF($B$17:$B$80,N17)+COUNTIF($K$17:$K$80,N17))=1,\"Used\",IF(COUNTIF($B$17:$B$80,N17)+COUNTIF($K$17:$K$80,N17)>1, \"Duplicated\",\"Available\"))","v":"Available"},17,{"$f":"IF((COUNTIF($B$17:$B$80,P17)+COUNTIF($K$17:$K$80,P17))=1,\"Used\",IF(COUNTIF($B$17:$B$80,P17)+COUNTIF($K$17:$K$80,P17)>1, \"Duplicated\",\"Available\"))","v":"Available"},33,{"$f":"IF((COUNTIF($B$17:$B$80,R17)+COUNTIF($K$17:$K$80,R17))=1,\"Used\",IF(COUNTIF($B$17:$B$80,R17)+COUNTIF($K$17:$K$80,R17)>1, \"Duplicated\",\"Available\"))","v":"Available"},49,{"$f":"IF((COUNTIF($B$17:$B$80,T17)+COUNTIF($K$17:$K$80,T17))=1,\"Used\",IF(COUNTIF($B$17:$B$80,T17)+COUNTIF($K$17:$K$80,T17)>1, \"Duplicated\",\"Available\"))","v":"Available"},null,{"$f":"B17","v":0},{"$f":"C17","v":" "},0,0,0,"",0,0," ","","   ",null,{"$f":"B49","v":0},{"$f":"C49","v":" "},{"$f":"D49","v":0},{"$f":"E49","v":0},{"$f":"F49","v":0},"",{"$f":"H49","v":0},0," ","","   ",null,null,null,null,{"$f":"B17","v":0},{"$f":"D17","v":0},{"$f":"E17","v":0},{"$f":"F17","v":0},{"$f":"H17","v":0},{"$f":"K17","v":""},null,{"$f":"L17","v":"   "},null,null,null,1,"N","A",null,"C",1]
[2,null," ",null,null,null,"",null,null," ","",{"$f":"B18&C18&D18&E18&F18&G18&H18&\" \"&I18&J18&K18","v":"   "},null,2,{"$f":"IF((COUNTIF($B$17:$B$80,N18)+COUNTIF($K$17:$K$80,N18))=1,\"Used\",IF(COUNTIF($B$17:$B$80,N18)+COUNTIF($K$17:$K$80,N18)>1, \"Duplicated\",\"Available\"))","v":"Available"},18,{"$f":"IF((COUNTIF($B$17:$B$80,P18)+COUNTIF($K$17:$K$80,P18))=1,\"Used\",IF(COUNTIF($B$17:$B$80,P18)+COUNTIF($K$17:$K$80,P18)>1, \"Duplicated\",\"Available\"))","v":"Available"},34,{"$f":"IF((COUNTIF($B$17:$B$80,R18)+COUNTIF($K$17:$K$80,R18))=1,\"Used\",IF(COUNTIF($B$17:$B$80,R18)+COUNTIF($K$17:$K$80,R18)>1, \"Duplicated\",\"Available\"))","v":"Available"},50,{"$f":"IF((COUNTIF($B$17:$B$80,T18)+COUNTIF($K$17:$K$80,T18))=1,\"Used\",IF(COUNTIF($B$17:$B$80,T18)+COUNTIF($K$17:$K$80,T18)>1, \"Duplicated\",\"Available\"))","v":"Available"},null,{"$f":"B18","v":0}," ",0,0,0,"",0,0," ","","   ",null,{"$f":"B50","v":0},{"$f":"C50","v":" "},0,0,0,{"$f":"G50","v":""},0,{"$f":"I50","v":0},{"$f":"J50","v":" "},{"$f":"K50","v":""},{"$f":"L50","v":"   "},null,null,null,null,{"$f":"B18","v":0},{"$f":"D18","v":0},{"$f":"E18","v":0},{"$f":"F18","v":0},{"$f":"H18","v":0},{"$f":"K18","v":""},null,"   ",null,null,null,2,"S","B",null,"*",2]
[3,null," ",null,null,null,"",null,null," ","",{"$f":"B19&C19&D19&E19&F19&G19&H19&\" \"&I19&J19&K19","v":"   "},null,3,"Available",19,"Available",35,"Available",51,"Available",null,{"$f":"B19","v":0},{"$f":"C19","v":" "},{"$f":"D19","v":0},{"$f":"E19","v":0},{"$f":"F19","v":0},{"$f":"G19","v":""},{"$f":"H19","v":0},{"$f":"I19","v":0},{"$f":"J19","v":" "},{"$f":"K19","v":""},{"$f":"L19","v":"   "},null,0," ",0,0,0,"",0,0," ","","   ",null,null,null,null,0,0,0,0,0,"",null,"   ",null,null,null,3,"E","C",null,null,3]
[4,null," ",null,null,null,"",null,null," ","",{"$f":"B20&C20&D20&E20&F20&G20&H20&\" \"&I20&J20&K20","v":"   "},null,4,"Available",20,"Available",36,"Available",52,"Available",null,0," ",0,0,0,"",0,0," ","","   ",null,0," ",0,0,0,"",0,0," ","","   ",null,null,null,null,0,0,0,0,0,"",null,"   ",null,null,null,4,"W","D",null,null,4]
[5,null," ",null,null,null,"",null,null," ","","   ",null,5,"Available",21,"Available",37,"Available",53,"Available",null,0," ",0,0,0,"",0,0," ","","   ",null,0," ",0,0,0,"",0,0," ","","   ",null,null,null,null,0,0,0,0,0,"",null,"   ",null,null,null,5,"NE","L",null,null,5]
[6,null," ",null,null,null,"",null,null," ","","   ",null,6,"Available",22,"Available",38,"Available",54,"Available",null,0," ",0,0,0,"",0,0," ","","   ",null,0," ",0,0,0,"",0,0," ","","   ",null,null,null,null,0,0,0,0,0,"",null,"   ",null,null,null,6,"NW","LA",null,null,6]
[7,null," ",null,null,null,"",null,null," ","","   ",null,7,"Available",23,"Available",39,"Available",55,"Available",null,0," ",0,0,0,"",0,0," ","","   ",null,0," ",0,0,0,"",0,0," ","","   ",null,null,null,null,0,0,0,0,0,"",null,"   ",null,null,null,7,"SE","LB",null,null,7]
[8,null," ",null,null,null,"",null,null," ","","   ",null,8,"Available",24,"Available",40,"Available",56,"Available",null,0," ",0,0,0,"",0,0," ","","   ",null,0," ",0,0,0,"",0,0," ","","   ",null,null,null,null,0,0,0,0,0,"",null,"   ",null,null,null,8,"SW","R",null,null,8]
[9,null," ",null,null,null,"",null,null," ","","   ",null,9,"Available",25,"Available",41,"Available",57,"Available",null,0," ",0,0,0,"",0,0," ","","   ",null,0," ",0,0,0,"",0,0," ","","   ",null,null,null,null,0,0,0,0,0,"",null,"   ",null,null,null,9,null,"RA",null,null,9]
[10,null," ",null,null,null,"",null,null," ","","   ",null,10,"Available",26,"Available",42,"Available",58,"Available",null,0," ",0,0,0,"",0,0," ","","   ",null,0," ",0,0,0,"",0,0," ","","   ",null,null,null,null,0,0,0,0,0,"",null,"   ",null,null,null,10,null,"RB",null,null,10]
[11,null," ",null,null,null,"",null,null," ","","   ",null,11,"Available",27,"Available",43,"Available",59,"Available",null,0," ",0,0,0,"",0,0," ","","   ",null,0," ",0,0,0,"",0,0," ","","   ",null,null,null,null,0,0,0,0,0,"",null,"   ",null,null,null,11,null,"E",null,null,11]
[12,null," ",null,null,null,"",null,null," ","","   ",null,12,"Available",28,"Available",44,"Available",60,"Available",null,0," ",0,0,0,"",0,0," ","","   ",null,0," ",0,0,0,"",0,0," ","","   ",null,null,null,null,0,0,0,0,0,"",null,"   ",null,null,null,12,null,"F",null,null,12]
[13,null," ",null,null,null,"",null,null," ","","   ",null,13,"Available",29,"Available",45,"Available",61,"Available",null,0," ",0,0,0,"",0,0," ","","   ",null,0," ",{"$f":"D61","v":0},{"$f":"E61","v":0},{"$f":"F61","v":0},"",{"$f":"H61","v":0},0," ","","   ",null,null,null,null,0,0,0,0,0,"",null,"   ",null,null,null,13,null,"A,B",null,null,13]
[14,null," ",null,null,null,"",null,null," ","","   ",null,14,"Available",30,"Available",46,"Available",62,"Available",null,0," ",0,0,0,"",0,0," ","","   ",null,0," ",0,0,0,"",0,0," ","","   ",null,null,null,null,0,0,0,0,0,"",null,"   ",null,null,null,14,null,"A,B,C",null,null,14]
[15,null," ",null,null,null,"",null,null," ","","   ",null,15,"Available",31,"Available",47,"Available",63,"Available",null,0," ",0,0,0,"",0,0," ","","   ",null,0," ",0,0,0,"",0,0," ","","   ",null,null,null,null,0,0,0,0,0,"",null,"   ",null,null,null,15,null,"A,B,C,D",null,null,15]
[16,null," ",null,null,null,"",null,null," ","","   ",null,16,"Available",32,"Available",48,"Available",64,"Available",null,0," ",0,0,0,"",0,0," ","","   ",null,0," ",0,0,0,"",0,0," ","","   ",null,null,null,null,0,0,0,0,0,"",null,"   ",null,null,null,16,null,"A,B,C,D,E",null,null,16]
[17,null," ",null,null,null,"",null,null," ","","   ",null,null,null,null,null,null,null,null,null,null,0," ",0,0,0,"",0,0," ","","   ",null,0," ",0,0,0,"",0,0," ","","   ",null,null,null,null,0,0,0,0,0,"",null,"   ",null,null,null,17,null,"A,B,C,D,E,F",null,null,"A"]
[18,null," ",null,null,null,"",null,null," ","","   ",null,null,null,null,null,null,null,null,null,null,0," ",0,0,0,"",0,0," ","","   ",null,0," ",0,0,0,"",0,0," ","","   ",null,null,null,null,0,0,0,0,0,"",null,"   ",null,null,null,18,null,"G",null,null,"B"]
[19,null," ",null,null,null,"",null,null," ","","   ",null,null,null,null,null,null,null,null,null,null,0," ",0,0,0,"",0,0," ","","   ",null,0," ",0,0,0,"",0,0," ","","   ",null,null,null,null,0,0,0,0,0,"",null,"   ",null,null,null,19,null,"H",null,null,"C"]
[20,null," ",null,null,null,"",null,null," ","","   ",null,null,null,null,null,null,null,null,null,null,0," ",0,0,0,"",0,0," ","","   ",null,0," ",0,0,0,"",0,0," ","","   ",null,null,null,null,0,0,0,0,0,"",null,"   ",null,null,null,20,null,"I",null,null,"D"]
[21,null," ",null,null,null,"",null,null," ","","   ",null,null,null,null,null,null,null,null,null,null,0," ",0,0,0,"",0,0," ","","   ",null,0," ",0,0,0,"",0,0," ","","   ",null,null,null,null,0,0,0,0,0,"",null,"   ",null,null,null,21,null,"J"]
[22,null," ",null,null,null,"",null,null," ","","   ",null,null,null,null,null,null,null,null,null,null,0," ",0,0,0,"",0,0," ","","   ",null,0," ",0,0,0,"",0,0," ","","   ",null,null,null,null,0,0,0,0,0,"",null,"   ",null,null,null,22,null,"A,B,C,D,E,F,G"]
[23,null," ",null,null,null,"",null,null," ","","   ",null,null,null,null,null,null,null,null,null,null,0," ",0,0,0,"",0,0," ","","   ",null,0," ",0,0,0,"",0,0," ","","   ",null,null,null,null,0,0,0,0,0,"",null,"   ",null,null,null,23,null,"A,B,C,D,E,F,G,H"]
[24,null," ",null,null,null,"",null,null," ","","   ",null,null,null,null,null,null,null,null,null,null,0," ",0,0,0,"",0,0," ","","   ",null,0," ",0,0,0,"",0,0," ","","   ",null,null,null,null,0,0,0,0,0,"",null,"   ",null,null,null,24,null,"A,B,C,D,E,F,G,H,I"]
[25,null," ",null,null,null,"",null,null," ","","   ",null,null,null,null,null,null,null,null,null,null,0," ",0,0,0,"",0,0," ","","   ",null,0," ",0,0,0,"",0,0," ","","   ",null,null,null,null,0,0,0,0,0,"",null,"   ",null,null,null,25,null,"A,B,C,D,E,F,G,H,I,J"]
[26,null," ",null,null,null,"",null,null," ","","   ",null,null,null,null,null,null,null,null,null,null,0," ",0,0,0,"",0,0," ","","   ",null,0," ",0,0,0,"",0,0," ","","   ",null,null,null,null,0,0,0,0,0,"",null,"   ",null,null,null,26,null,"LC"]
[27,null," ",null,null,null,"",null,null," ","",{"$f":"B43&C43&D43&E43&F43&G43&H43&\" \"&I43&J43&K43","v":"   "},null,null,null,null,null,null,null,null,null,null,0," ",{"$f":"D43","v":0},0,0,"",{"$f":"H43","v":0},0," ","","   ",null,0," ",0,0,0,"",0,0," ","","   ",null,null,null,null,0,{"$f":"D43","v":0},0,0,{"$f":"H43","v":0},"",null,"   ",null,null,null,27,null,"LD"]
[28,null," ",null,null,null,"",null,null," ","","   ",null,null,null,null,null,null,null,null,null,null,0," ",0,0,0,"",0,0," ","","   ",null,0," ",0,0,0,"",0,0," ","","   ",null,null,null,null,0,0,0,0,0,"",null,"   ",null,null,null,28,null,"LE"]
[29,null," ",null,null,null,"",null,null," ","","   ",null,null,null,null,null,null,null,null,null,null,0," ",0,0,0,"",0,0," ","","   ",null,0," ",0,0,0,"",0,0," ","","   ",null,null,null,null,0,0,0,0,0,"",null,"   ",null,null,null,29,null,"LF"]
[30,null," ",null,null,null,"",null,null," ","","   ",null,null,null,null,null,null,null,null,null,null,0," ",0,0,0,"",0,0," ","","   ",null,0," ",0,0,0,"",0,0," ","","   ",null,null,null,null,0,0,0,0,0,"",null,"   ",null,null,null,30,null,"RC"]
[31,null," ",null,null,null,"",null,null," ","","   ",null,null,null,null,null,null,null,null,null,null,0," ",0,0,0,"",0,0," ","","   ",null,0," ",0,0,0,"",0,0," ","","   ",null,null,null,null,0,0,0,0,0,"",null,"   ",null,null,null,31,null,"RD"]
[32,null," ",null,null,null,"",null,null," ","","   ",null,null,null,null,null,null,null,null,null,null,0," ",0,0,0,"",0,0," ","","   ",null,0," ",0,0,0,"",0,0," ","","   ",null,null,null,null,0,0,0,0,0,"",null,"   ",null,null,null,32,null,"RE"]
[33,null,{"$f":"IF(D49=0,\" \",\"-\")","v":" "},null,null,null,{"$f":"IF(H49=\"\",\"\",\"-\")","v":""},null,null,{"$f":"IF(I49=\"C\",\"-\",\" \")","v":" "},{"$f":"IF(I49 = \"C\", B49+2,\"\")","v":""},"   ",null,null,null,null,null,null,null,null,null,null,null,null,null,null,null,null,null,null,null,null,null,null,null,null,null,null,null,null,null,null,null,null,null,null,null,null,null,0,0,0,0,0,"",null,{"$f":"L49","v":"   "},null,null,null,33,null,"RF"]
[34,null," ",null,null,null,"",null,null," ","","   ",null,null,null,null,null,null,null,null,null,null,"Legend",null,"Detectors 1-16",null,null,null,null,null,null,null,null,null,null,null,null,null,null,null,null,null,null,null,null,null,null,null,null,0,0,0,0,0,"",null,"   ",null,null,null,34]
[35,null," ",null,null,null,"",null,null," ","","   ",null,null,null,null,null,null,null,null,null,null,null,null,"Detectors 17-32",null,null,null,null,null,null,null,null,null,null,null,null,null,null,null,null,null,null,null,null,null,null,null,null,0,0,0,0,0,"",null,"   ",null,null,null,35]
[36,null," ",null,null,null,"",null,null," ","","   ",null,null,null,null,null,null,null,null,null,null,null,null,"Detectors 33-48",null,null,null,null,null,null,null,null,null,null,null,null,null,null,null,null,null,null,null,null,null,null,null,null,0,0,0,0,0,"",null,"   ",null,null,null,36]
[37,null," ",null,null,null,"",null,null," ","","   ",null,null,null,null,null,null,null,null,null,null,null,null,"Detectors 49-64",null,null,null,null,null,null,null,null,null,null,null,null,null,null,null,null,null,null,null,null,null,null,null,null,0,0,0,0,0,"",null,"   ",null,null,null,37]
[38,null," ",null,null,null,"",null,null," ","","   ",null,null,null,null,null,null,null,null,null,null,null,null,null,null,null,null,null,null,null,null,null,null,null,null,null,null,null,null,null,null,null,null,null,null,null,null,null,0,0,0,0,0,"",null,"   ",null,null,null,38]
[39,null," ",null,null,null,"",null,null," ","","   ",null,null,null,null,null,null,null,null,null,null,null,null,null,null,null,null,null,null,null,null,null,null,null,null,null,null,null,null,null,null,null,null,null,null,null,null,null,0,0,0,0,0,"",null,"   ",null,null,null,39]
[40,null," ",null,null,null,"",null,null," ","","   ",null,null,null,null,null,null,null,null,null,null,null,null,null,null,null,null,null,null,null,null,null,null,null,null,null,null,null,null,null,null,null,null,null,null,null,null,null,0,0,0,0,0,"",null,"   ",null,null,null,40]
[41,null," ",null,null,null,"",null,null," ","","   ",null,null,null,null,null,null,null,null,null,null,null,null,null,null,null,null,null,null,null,null,null,null,null,null,null,null,null,null,null,null,null,null,null,null,null,null,null,0,0,0,0,0,"",null,"   ",null,null,null,41]
[42,null," ",null,null,null,"",null,null," ","","   ",null,null,null,null,null,null,null,null,null,null,null,null,null,null,null,null,null,null,null,null,null,null,null,null,null,null,null,null,null,null,null,null,null,null,null,null,null,0,0,0,0,0,"",null,"   ",null,null,null,42]
[43,null," ",null,null,null,"",null,null," ","","   ",null,null,null,null,null,null,null,null,null,null,null,null,null,null,null,null,null,null,null,null,null,null,null,null,null,null,null,null,null,null,null,null,null,null,null,null,null,0,0,0,0,0,"",null,"   ",null,null,null,43]
[44,null," ",null,null,null,"",null,null," ","","   ",null,null,null,null,null,null,null,null,null,null,null,null,null,null,null,null,null,null,null,null,null,null,null,null,null,null,null,null,null,null,null,null,null,null,null,null,null,0,0,0,0,0,"",null,"   ",null,null,null,44]
[45,null," ",null,null,null,"",null,null," ","","   ",null,null,null,null,null,null,null,null,null,null,null,null,null,null,null,null,null,null,null,null,null,null,null,null,null,null,null,null,null,null,null,null,null,null,null,null,null,0,0,0,0,0,"",null,"   ",null,null,null,45]
[46,null," ",null,null,null,"",null,null," ","","   ",null,null,null,null,null,null,null,null,null,null,null,null,null,null,null,null,null,null,null,null,null,null,null,null,null,null,null,null,null,null,null,null,null,null,null,null,null,0,0,0,0,0,"",null,"   ",null,null,null,46]
[47,null," ",null,null,null,"",null,null," ","","   ",null,null,null,null,null,null,null,null,null,null,null,null,null,null,null,null,null,null,null,null,null,null,null,null,null,null,null,null,null,null,null,null,null,null,null,null,null,0,0,0,0,0,"",null,"   ",null,null,null,47]
[48,null," ",null,null,null,"",null,null," ","","   ",null,null,null,null,null,null,null,null,null,null,null,null,null,null,null,null,null,null,null,null,null,null,null,null,null,null,null,null,null,null,null,null,null,null,null,null,null,0,0,0,0,0,"",null,"   ",null,null,null,48]
[49,null," ",null,null,null,"",null,null," ","","   ",null,null,null,null,null,null,null,null,null,null,null,null,null,null,null,null,null,null,null,null,null,null,null,null,null,null,null,null,null,null,null,null,null,null,null,null,null,0,0,0,0,0,"",null,"   ",null,null,null,49]
[50,null," ",null,null,null,"",null,null," ","","   ",null,null,null,null,null,null,null,null,null,null,null,null,null,null,null,null,null,null,null,null,null,null,null,null,null,null,null,null,null,null,null,null,null,null,null,null,null,0,0,0,0,0,"",null,"   ",null,null,null,50]
[51,null," ",null,null,null,"",null,null," ","","   ",null,null,null,null,null,null,null,null,null,null,null,null,null,null,null,null,null,null,null,null,null,null,null,null,null,null,null,null,null,null,null,null,null,null,null,null,null,0,0,0,0,0,"",null,"   ",null,null,null,51]
[52,null," ",null,null,null,"",null,null," ","","   ",null,null,null,null,null,null,null,null,null,null,null,null,null,null,null,null,null,null,null,null,null,null,null,null,null,null,null,null,null,null,null,null,null,null,null,null,null,0,0,0,0,0,"",null,"   ",null,null,null,52]
[53,null," ",null,null,null,"",null,null," ","","   ",null,null,null,null,null,null,null,null,null,null,null,null,null,null,null,null,null,null,null,null,null,null,null,null,null,null,null,null,null,null,null,null,null,null,null,null,null,0,0,0,0,0,"",null,"   ",null,null,null,53]
[54,null," ",null,null,null,"",null,null," ","","   ",null,null,null,null,null,null,null,null,null,null,null,null,null,null,null,null,null,null,null,null,null,null,null,null,null,null,null,null,null,null,null,null,null,null,null,null,null,0,0,0,0,0,"",null,"   ",null,null,null,54]
[55,null," ",null,null,null,"",null,null," ","","   ",null,null,null,null,null,null,null,null,null,null,null,null,null,null,null,null,null,null,null,null,null,null,null,null,null,null,null,null,null,null,null,null,null,null,null,null,null,0,0,0,0,0,"",null,"   ",null,null,null,55]
[56,null," ",null,null,null,"",null,null," ","","   ",null,null,null,null,null,null,null,null,null,null,null,null,null,null,null,null,null,null,null,null,null,null,null,null,null,null,null,null,null,null,null,null,null,null,null,null,null,0,0,0,0,0,"",null,"   ",null,null,null,56]
[57,null," ",null,null,null,"",null,null," ","","   ",null,null,null,null,null,null,null,null,null,null,null,null,null,null,null,null,null,null,null,null,null,null,null,null,null,null,null,null,null,null,null,null,null,null,null,null,null,0,0,0,0,0,"",null,"   ",null,null,null,57]
[58,null," ",null,null,null,"",null,null," ","","   ",null,null,null,null,null,null,null,null,null,null,null,null,null,null,null,null,null,null,null,null,null,null,null,null,null,null,null,null,null,null,null,null,null,null,null,null,null,0,0,0,0,0,"",null,"   ",null,null,null,58]
[59,null," ",null,null,null,"",null,null," ","","   ",null,null,null,null,null,null,null,null,null,null,null,null,null,null,null,null,null,null,null,null,null,null,null,null,null,null,null,null,null,null,null,null,null,null,null,null,null,0,0,0,0,0,"",null,"   ",null,null,null,59]
[60,null," ",null,null,null,"",null,null," ","","   ",null,null,null,null,null,null,null,null,null,null,null,null,null,null,null,null,null,null,null,null,null,null,null,null,null,null,null,null,null,null,null,null,null,null,null,null,null,0,0,0,0,0,"",null,"   ",null,null,null,60]
[61,null," ",null,null,null,"",null,null," ","","   ",null,null,null,null,null,null,null,null,null,null,null,null,null,null,null,null,null,null,null,null,null,null,null,null,null,null,null,null,null,null,null,null,null,null,null,null,null,0,0,0,0,0,"",null,"   ",null,null,null,61]
[62,null," ",null,null,null,"",null,null," ","","   ",null,null,null,null,null,null,null,null,null,null,null,null,null,null,null,null,null,null,null,null,null,null,null,null,null,null,null,null,null,null,null,null,null,null,null,null,null,0,0,0,0,0,"",null,"   ",null,null,null,62]
[63,null," ",null,null,null,"",null,null," ","","   ",null,null,null,null,null,null,null,null,null,null,null,null,null,null,null,null,null,null,null,null,null,null,null,null,null,null,null,null,null,null,null,null,null,null,null,null,null,0,0,0,0,0,"",null,"   ",null,null,null,63]
[64,null," ",null,null,null,"",null,null," ","","   ",null,null,null,null,null,null,null,null,null,null,null,null,null,null,null,null,null,null,null,null,null,null,null,null,null,null,null,null,null,null,null,null,null,null,null,null,null,0,0,0,0,0,"",null,"   ",null,null,null,64]

{"sheet":"Dymo 450 Rack Labels","index":1,"n_rows":64,"n_cols":26,"rows_kept":64,"cut":false,"hidden":false,"merged":[]}
[null,null,null,null,null,null,null,null,null,null,null,null,null,{"$f":"'Data Entry Sheet'!B17","v":0},{"$f":"'Data Entry Sheet'!C17","v":" "},{"$f":"'Data Entry Sheet'!D17","v":0},{"$f":"'Data Entry Sheet'!E17","v":0},{"$f":"'Data Entry Sheet'!F17","v":0},{"$f":"'Data Entry Sheet'!G17","v":""},{"$f":"'Data Entry Sheet'!H17","v":0},{"$f":"'Data Entry Sheet'!I17","v":0},{"$f":"'Data Entry Sheet'!J17","v":" "},{"$f":"'Data Entry Sheet'!K17","v":""},null,{"$f":"N1&O1&P1&Q1&R1&S1&T1","v":"0 0000"},{"$f":"IF(U1 = \"C\", U1&V1&W1, \"---\")","v":"---"}]
[null,null,null,null,null,null,null,null,null,null,null,null,null,{"$f":"'Data Entry Sheet'!B18","v":0},{"$f":"'Data Entry Sheet'!C18","v":" "},{"$f":"'Data Entry Sheet'!D18","v":0},{"$f":"'Data Entry Sheet'!E18","v":0},{"$f":"'Data Entry Sheet'!F18","v":0},{"$f":"'Data Entry Sheet'!G18","v":""},{"$f":"'Data Entry Sheet'!H18","v":0},{"$f":"'Data Entry Sheet'!I18","v":0},{"$f":"'Data Entry Sheet'!J18","v":" "},{"$f":"'Data Entry Sheet'!K18","v":""},null,{"$f":"N2&O2&P2&Q2&R2&S2&T2","v":"0 0000"},{"$f":"IF(U2 = \"C\", U2&V2&W2, \"---\")","v":"---"}]
[null,null,null,null,null,null,null,null,null,null,null,null,null,{"$f":"'Data Entry Sheet'!B19","v":0},{"$f":"'Data Entry Sheet'!C19","v":" "},{"$f":"'Data Entry Sheet'!D19","v":0},{"$f":"'Data Entry Sheet'!E19","v":0},{"$f":"'Data Entry Sheet'!F19","v":0},{"$f":"'Data Entry Sheet'!G19","v":""},{"$f":"'Data Entry Sheet'!H19","v":0},{"$f":"'Data Entry Sheet'!I19","v":0},{"$f":"'Data Entry Sheet'!J19","v":" "},{"$f":"'Data Entry Sheet'!K19","v":""},null,"0 0000","---"]
["Diamond Interchange Ramp      ==>",null,null,null,null,null,null,null,null,null,null,null,null,{"$f":"'Data Entry Sheet'!B20","v":0},{"$f":"'Data Entry Sheet'!C20","v":" "},{"$f":"'Data Entry Sheet'!D20","v":0},{"$f":"'Data Entry Sheet'!E20","v":0},{"$f":"'Data Entry Sheet'!F20","v":0},{"$f":"'Data Entry Sheet'!G20","v":""},{"$f":"'Data Entry Sheet'!H20","v":0},{"$f":"'Data Entry Sheet'!I20","v":0},{"$f":"'Data Entry Sheet'!J20","v":" "},{"$f":"'Data Entry Sheet'!K20","v":""},null,"0 0000","---"]
["Add Detector Rack comments below",null,null,null,null,null,null,null,null,null,null,null,null,{"$f":"'Data Entry Sheet'!B21","v":0},{"$f":"'Data Entry Sheet'!C21","v":" "},{"$f":"'Data Entry Sheet'!D21","v":0},{"$f":"'Data Entry Sheet'!E21","v":0},{"$f":"'Data Entry Sheet'!F21","v":0},{"$f":"'Data Entry Sheet'!G21","v":""},{"$f":"'Data Entry Sheet'!H21","v":0},{"$f":"'Data Entry Sheet'!I21","v":0},{"$f":"'Data Entry Sheet'!J21","v":" "},{"$f":"'Data Entry Sheet'!K21","v":""},null,"0 0000","---"]
[{"$f":"'Data Entry Sheet'!E11 & \" -- RACK 1 (1-16)\"","v":" -- RACK 1 (1-16)"},{"$f":"IF(COUNTIF($N$1:$N$64,3)>0,VLOOKUP(3,$N$1:$Z$64,12,FALSE),\"3-\")","v":"3-"},{"$f":"IF(COUNTIF($N$1:$N$64,1)>0,VLOOKUP(1,$N$1:$Z$64,12,FALSE),\"1-\")","v":"1-"},{"$f":"IF(COUNTIF($N$1:$N$64,7)>0,VLOOKUP(7,$N$1:$Z$64,12,FALSE),\"7-\")","v":"7-"},{"$f":"IF(COUNTIF($N$1:$N$64,5)>0,VLOOKUP(5,$N$1:$Z$64,12,FALSE),\"5-\")","v":"5-"},{"$f":"IF(COUNTIF($N$1:$N$64,11)>0,VLOOKUP(11,$N$1:$Z$64,12,FALSE),\"11-\")","v":"11-"},{"$f":"IF(COUNTIF($N$1:$N$64,9)>0,VLOOKUP(9,$N$1:$Z$64,12,FALSE),\"9-\")","v":"9-"},{"$f":"IF(COUNTIF($N$1:$N$64,15)>0,VLOOKUP(15,$N$1:$Z$64,12,FALSE),\"15-\")","v":"15-"},{"$f":"IF(COUNTIF($N$1:$N$64,13)>0,VLOOKUP(13,$N$1:$Z$64,12,FALSE),\"13-\")","v":"13-"},null,null,null,null,{"$f":"'Data Entry Sheet'!B22","v":0},{"$f":"'Data Entry Sheet'!C22","v":" "},{"$f":"'Data Entry Sheet'!D22","v":0},{"$f":"'Data Entry Sheet'!E22","v":0},{"$f":"'Data Entry Sheet'!F22","v":0},{"$f":"'Data Entry Sheet'!G22","v":""},{"$f":"'Data Entry Sheet'!H22","v":0},{"$f":"'Data Entry Sheet'!I22","v":0},{"$f":"'Data Entry Sheet'!J22","v":" "},{"$f":"'Data Entry Sheet'!K22","v":""},null,"0 0000","---"]
[{"$f":"IF(B4 = \"\", 'Data Entry Sheet'!E12, B4)","v":0},{"$f":"IF(COUNTIF($N$1:$N$64,3)>0,VLOOKUP(3,$N$1:$Z$64,13,FALSE),\"---\")","v":"---"},{"$f":"IF(COUNTIF($N$1:$N$64,1)>0,VLOOKUP(1,$N$1:$Z$64,13,FALSE),\"---\")","v":"---"},{"$f":"IF(COUNTIF($N$1:$N$64,7)>0,VLOOKUP(7,$N$1:$Z$64,13,FALSE),\"---\")","v":"---"},{"$f":"IF(COUNTIF($N$1:$N$64,5)>0,VLOOKUP(5,$N$1:$Z$64,13,FALSE),\"---\")","v":"---"},{"$f":"IF(COUNTIF($N$1:$N$64,11)>0,VLOOKUP(11,$N$1:$Z$64,13,FALSE),\"---\")","v":"---"},{"$f":"IF(COUNTIF($N$1:$N$64,9)>0,VLOOKUP(9,$N$1:$Z$64,13,FALSE),\"---\")","v":"---"},{"$f":"IF(COUNTIF($N$1:$N$64,15)>0,VLOOKUP(15,$N$1:$Z$64,13,FALSE),\"---\")","v":"---"},{"$f":"IF(COUNTIF($N$1:$N$64,13)>0,VLOOKUP(13,$N$1:$Z$64,13,FALSE),\"---\")","v":"---"},null,null,null,null,{"$f":"'Data Entry Sheet'!B23","v":0},{"$f":"'Data Entry Sheet'!C23","v":" "},{"$f":"'Data Entry Sheet'!D23","v":0},{"$f":"'Data Entry Sheet'!E23","v":0},{"$f":"'Data Entry Sheet'!F23","v":0},{"$f":"'Data Entry Sheet'!G23","v":""},{"$f":"'Data Entry Sheet'!H23","v":0},{"$f":"'Data Entry Sheet'!I23","v":0},{"$f":"'Data Entry Sheet'!J23","v":" "},{"$f":"'Data Entry Sheet'!K23","v":""},null,"0 0000","---"]
[null,{"$f":"IF(COUNTIF($N$1:$N$64,4)>0,VLOOKUP(4,$N$1:$Z$64,12,FALSE),\"4-\")","v":"4-"},{"$f":"IF(COUNTIF($N$1:$N$64,2)>0,VLOOKUP(2,$N$1:$Z$64,12,FALSE),\"2-\")","v":"2-"},{"$f":"IF(COUNTIF($N$1:$N$64,8)>0,VLOOKUP(8,$N$1:$Z$64,12,FALSE),\"8-\")","v":"8-"},{"$f":"IF(COUNTIF($N$1:$N$64,6)>0,VLOOKUP(6,$N$1:$Z$64,12,FALSE),\"6-\")","v":"6-"},{"$f":"IF(COUNTIF($N$1:$N$64,12)>0,VLOOKUP(12,$N$1:$Z$64,12,FALSE),\"12-\")","v":"12-"},{"$f":"IF(COUNTIF($N$1:$N$64,10)>0,VLOOKUP(10,$N$1:$Z$64,12,FALSE),\"10-\")","v":"10-"},{"$f":"IF(COUNTIF($N$1:$N$64,16)>0,VLOOKUP(16,$N$1:$Z$64,12,FALSE),\"16-\")","v":"16-"},{"$f":"IF(COUNTIF($N$1:$N$64,14)>0,VLOOKUP(14,$N$1:$Z$64,12,FALSE),\"14-\")","v":"14-"},null,null,null,null,{"$f":"'Data Entry Sheet'!B24","v":0},{"$f":"'Data Entry Sheet'!C24","v":" "},{"$f":"'Data Entry Sheet'!D24","v":0},{"$f":"'Data Entry Sheet'!E24","v":0},{"$f":"'Data Entry Sheet'!F24","v":0},{"$f":"'Data Entry Sheet'!G24","v":""},{"$f":"'Data Entry Sheet'!H24","v":0},{"$f":"'Data Entry Sheet'!I24","v":0},{"$f":"'Data Entry Sheet'!J24","v":" "},{"$f":"'Data Entry Sheet'!K24","v":""},null,"0 0000","---"]
[null,{"$f":"IF(COUNTIF($N$1:$N$64,4)>0,VLOOKUP(4,$N$1:$Z$64,13,FALSE),\"---\")","v":"---"},{"$f":"IF(COUNTIF($N$1:$N$64,2)>0,VLOOKUP(2,$N$1:$Z$64,13,FALSE),\"---\")","v":"---"},{"$f":"IF(COUNTIF($N$1:$N$64,8)>0,VLOOKUP(8,$N$1:$Z$64,13,FALSE),\"---\")","v":"---"},{"$f":"IF(COUNTIF($N$1:$N$64,6)>0,VLOOKUP(6,$N$1:$Z$64,13,FALSE),\"---\")","v":"---"},{"$f":"IF(COUNTIF($N$1:$N$64,12)>0,VLOOKUP(12,$N$1:$Z$64,13,FALSE),\"---\")","v":"---"},{"$f":"IF(COUNTIF($N$1:$N$64,10)>0,VLOOKUP(10,$N$1:$Z$64,13,FALSE),\"---\")","v":"---"},{"$f":"IF(COUNTIF($N$1:$N$64,16)>0,VLOOKUP(16,$N$1:$Z$64,13,FALSE),\"---\")","v":"---"},{"$f":"IF(COUNTIF($N$1:$N$64,14)>0,VLOOKUP(14,$N$1:$Z$64,13,FALSE),\"---\")","v":"---"},null,null,null,null,{"$f":"'Data Entry Sheet'!B25","v":0},{"$f":"'Data Entry Sheet'!C25","v":" "},{"$f":"'Data Entry Sheet'!D25","v":0},{"$f":"'Data Entry Sheet'!E25","v":0},{"$f":"'Data Entry Sheet'!F25","v":0},{"$f":"'Data Entry Sheet'!G25","v":""},{"$f":"'Data Entry Sheet'!H25","v":0},{"$f":"'Data Entry Sheet'!I25","v":0},{"$f":"'Data Entry Sheet'!J25","v":" "},{"$f":"'Data Entry Sheet'!K25","v":""},null,"0 0000","---"]
[null,null,null,null,null,null,null,null,null,null,null,null,null,{"$f":"'Data Entry Sheet'!B26","v":0},{"$f":"'Data Entry Sheet'!C26","v":" "},{"$f":"'Data Entry Sheet'!D26","v":0},{"$f":"'Data Entry Sheet'!E26","v":0},{"$f":"'Data Entry Sheet'!F26","v":0},{"$f":"'Data Entry Sheet'!G26","v":""},{"$f":"'Data Entry Sheet'!H26","v":0},{"$f":"'Data Entry Sheet'!I26","v":0},{"$f":"'Data Entry Sheet'!J26","v":" "},{"$f":"'Data Entry Sheet'!K26","v":""},null,"0 0000","---"]
[{"$f":"'Data Entry Sheet'!E11 & \" -- RACK 2 (17-32)\"","v":" -- RACK 2 (17-32)"},{"$f":"IF(COUNTIF($N$1:$N$64,19)>0,VLOOKUP(19,$N$1:$Z$64,12,FALSE),\"19-\")","v":"19-"},{"$f":"IF(COUNTIF($N$1:$N$64,17)>0,VLOOKUP(17,$N$1:$Z$64,12,FALSE),\"17-\")","v":"17-"},{"$f":"IF(COUNTIF($N$1:$N$64,23)>0,VLOOKUP(23,$N$1:$Z$64,12,FALSE),\"23-\")","v":"23-"},{"$f":"IF(COUNTIF($N$1:$N$64,21)>0,VLOOKUP(21,$N$1:$Z$64,12,FALSE),\"21-\")","v":"21-"},{"$f":"IF(COUNTIF($N$1:$N$64,27)>0,VLOOKUP(27,$N$1:$Z$64,12,FALSE),\"27-\")","v":"27-"},{"$f":"IF(COUNTIF($N$1:$N$64,25)>0,VLOOKUP(25,$N$1:$Z$64,12,FALSE),\"25-\")","v":"25-"},{"$f":"IF(COUNTIF($N$1:$N$64,31)>0,VLOOKUP(31,$N$1:$Z$64,12,FALSE),\"31-\")","v":"31-"},{"$f":"IF(COUNTIF($N$1:$N$64,29)>0,VLOOKUP(29,$N$1:$Z$64,12,FALSE),\"29-\")","v":"29-"},null,null,null,null,{"$f":"'Data Entry Sheet'!B27","v":0},{"$f":"'Data Entry Sheet'!C27","v":" "},{"$f":"'Data Entry Sheet'!D27","v":0},{"$f":"'Data Entry Sheet'!E27","v":0},{"$f":"'Data Entry Sheet'!F27","v":0},{"$f":"'Data Entry Sheet'!G27","v":""},{"$f":"'Data Entry Sheet'!H27","v":0},{"$f":"'Data Entry Sheet'!I27","v":0},{"$f":"'Data Entry Sheet'!J27","v":" "},{"$f":"'Data Entry Sheet'!K27","v":""},null,"0 0000","---"]
[{"$f":"IF(C4 = \"\", 'Data Entry Sheet'!E12, C4)","v":0},{"$f":"IF(COUNTIF($N$1:$N$64,19)>0,VLOOKUP(19,$N$1:$Z$64,13,FALSE),\"---\")","v":"---"},{"$f":"IF(COUNTIF($N$1:$N$64,17)>0,VLOOKUP(17,$N$1:$Z$64,13,FALSE),\"---\")","v":"---"},{"$f":"IF(COUNTIF($N$1:$N$64,23)>0,VLOOKUP(23,$N$1:$Z$64,13,FALSE),\"---\")","v":"---"},{"$f":"IF(COUNTIF($N$1:$N$64,21)>0,VLOOKUP(21,$N$1:$Z$64,13,FALSE),\"---\")","v":"---"},{"$f":"IF(COUNTIF($N$1:$N$64,27)>0,VLOOKUP(27,$N$1:$Z$64,13,FALSE),\"---\")","v":"---"},{"$f":"IF(COUNTIF($N$1:$N$64,25)>0,VLOOKUP(25,$N$1:$Z$64,13,FALSE),\"---\")","v":"---"},{"$f":"IF(COUNTIF($N$1:$N$64,31)>0,VLOOKUP(31,$N$1:$Z$64,13,FALSE),\"---\")","v":"---"},{"$f":"IF(COUNTIF($N$1:$N$64,29)>0,VLOOKUP(29,$N$1:$Z$64,13,FALSE),\"---\")","v":"---"},null,null,null,null,{"$f":"'Data Entry Sheet'!B28","v":0},{"$f":"'Data Entry Sheet'!C28","v":" "},{"$f":"'Data Entry Sheet'!D28","v":0},{"$f":"'Data Entry Sheet'!E28","v":0},{"$f":"'Data Entry Sheet'!F28","v":0},{"$f":"'Data Entry Sheet'!G28","v":""},{"$f":"'Data Entry Sheet'!H28","v":0},{"$f":"'Data Entry Sheet'!I28","v":0},{"$f":"'Data Entry Sheet'!J28","v":" "},{"$f":"'Data Entry Sheet'!K28","v":""},null,"0 0000","---"]
[null,{"$f":"IF(COUNTIF($N$1:$N$64,20)>0,VLOOKUP(20,$N$1:$Z$64,12,FALSE),\"20-\")","v":"20-"},{"$f":"IF(COUNTIF($N$1:$N$64,18)>0,VLOOKUP(18,$N$1:$Z$64,12,FALSE),\"18-\")","v":"18-"},{"$f":"IF(COUNTIF($N$1:$N$64,24)>0,VLOOKUP(24,$N$1:$Z$64,12,FALSE),\"24-\")","v":"24-"},{"$f":"IF(COUNTIF($N$1:$N$64,22)>0,VLOOKUP(22,$N$1:$Z$64,12,FALSE),\"22-\")","v":"22-"},{"$f":"IF(COUNTIF($N$1:$N$64,28)>0,VLOOKUP(28,$N$1:$Z$64,12,FALSE),\"28-\")","v":"28-"},{"$f":"IF(COUNTIF($N$1:$N$64,26)>0,VLOOKUP(26,$N$1:$Z$64,12,FALSE),\"26-\")","v":"26-"},{"$f":"IF(COUNTIF($N$1:$N$64,32)>0,VLOOKUP(32,$N$1:$Z$64,12,FALSE),\"32-\")","v":"32-"},{"$f":"IF(COUNTIF($N$1:$N$64,30)>0,VLOOKUP(30,$N$1:$Z$64,12,FALSE),\"30-\")","v":"30-"},null,null,null,null,{"$f":"'Data Entry Sheet'!B29","v":0},{"$f":"'Data Entry Sheet'!C29","v":" "},{"$f":"'Data Entry Sheet'!D29","v":0},{"$f":"'Data Entry Sheet'!E29","v":0},{"$f":"'Data Entry Sheet'!F29","v":0},{"$f":"'Data Entry Sheet'!G29","v":""},{"$f":"'Data Entry Sheet'!H29","v":0},{"$f":"'Data Entry Sheet'!I29","v":0},{"$f":"'Data Entry Sheet'!J29","v":" "},{"$f":"'Data Entry Sheet'!K29","v":""},null,"0 0000","---"]
[null,{"$f":"IF(COUNTIF($N$1:$N$64,20)>0,VLOOKUP(20,$N$1:$Z$64,13,FALSE),\"---\")","v":"---"},{"$f":"IF(COUNTIF($N$1:$N$64,18)>0,VLOOKUP(18,$N$1:$Z$64,13,FALSE),\"---\")","v":"---"},{"$f":"IF(COUNTIF($N$1:$N$64,24)>0,VLOOKUP(24,$N$1:$Z$64,13,FALSE),\"---\")","v":"---"},{"$f":"IF(COUNTIF($N$1:$N$64,22)>0,VLOOKUP(22,$N$1:$Z$64,13,FALSE),\"---\")","v":"---"},{"$f":"IF(COUNTIF($N$1:$N$64,28)>0,VLOOKUP(28,$N$1:$Z$64,13,FALSE),\"---\")","v":"---"},{"$f":"IF(COUNTIF($N$1:$N$64,26)>0,VLOOKUP(26,$N$1:$Z$64,13,FALSE),\"---\")","v":"---"},{"$f":"IF(COUNTIF($N$1:$N$64,32)>0,VLOOKUP(32,$N$1:$Z$64,13,FALSE),\"---\")","v":"---"},{"$f":"IF(COUNTIF($N$1:$N$64,30)>0,VLOOKUP(30,$N$1:$Z$64,13,FALSE),\"---\")","v":"---"},null,null,null,null,{"$f":"'Data Entry Sheet'!B30","v":0},{"$f":"'Data Entry Sheet'!C30","v":" "},{"$f":"'Data Entry Sheet'!D30","v":0},{"$f":"'Data Entry Sheet'!E30","v":0},{"$f":"'Data Entry Sheet'!F30","v":0},{"$f":"'Data Entry Sheet'!G30","v":""},{"$f":"'Data Entry Sheet'!H30","v":0},{"$f":"'Data Entry Sheet'!I30","v":0},{"$f":"'Data Entry Sheet'!J30","v":" "},{"$f":"'Data Entry Sheet'!K30","v":""},null,"0 0000","---"]
[null,null,null,null,null,null,null,null,null,null,null,null,null,{"$f":"'Data Entry Sheet'!B31","v":0},{"$f":"'Data Entry Sheet'!C31","v":" "},{"$f":"'Data Entry Sheet'!D31","v":0},{"$f":"'Data Entry Sheet'!E31","v":0},{"$f":"'Data Entry Sheet'!F31","v":0},{"$f":"'Data Entry Sheet'!G31","v":""},{"$f":"'Data Entry Sheet'!H31","v":0},{"$f":"'Data Entry Sheet'!I31","v":0},{"$f":"'Data Entry Sheet'!J31","v":" "},{"$f":"'Data Entry Sheet'!K31","v":""},null,"0 0000","---"]
[{"$f":"'Data Entry Sheet'!E11 & \" -- RACK 3 (33-48)\"","v":" -- RACK 3 (33-48)"},{"$f":"IF(COUNTIF($N$1:$N$64,35)>0,VLOOKUP(35,$N$1:$Z$64,12,FALSE),\"35-\")","v":"35-"},{"$f":"IF(COUNTIF($N$1:$N$64,33)>0,VLOOKUP(33,$N$1:$Z$64,12,FALSE),\"33-\")","v":"33-"},{"$f":"IF(COUNTIF($N$1:$N$64,39)>0,VLOOKUP(39,$N$1:$Z$64,12,FALSE),\"39-\")","v":"39-"},{"$f":"IF(COUNTIF($N$1:$N$64,37)>0,VLOOKUP(37,$N$1:$Z$64,12,FALSE),\"37-\")","v":"37-"},{"$f":"IF(COUNTIF($N$1:$N$64,43)>0,VLOOKUP(43,$N$1:$Z$64,12,FALSE),\"43-\")","v":"43-"},{"$f":"IF(COUNTIF($N$1:$N$64,41)>0,VLOOKUP(41,$N$1:$Z$64,12,FALSE),\"41-\")","v":"41-"},{"$f":"IF(COUNTIF($N$1:$N$64,47)>0,VLOOKUP(47,$N$1:$Z$64,12,FALSE),\"47-\")","v":"47-"},{"$f":"IF(COUNTIF($N$1:$N$64,45)>0,VLOOKUP(45,$N$1:$Z$64,12,FALSE),\"45-\")","v":"45-"},null,null,null,null,{"$f":"'Data Entry Sheet'!B32","v":0},{"$f":"'Data Entry Sheet'!C32","v":" "},{"$f":"'Data Entry Sheet'!D32","v":0},{"$f":"'Data Entry Sheet'!E32","v":0},{"$f":"'Data Entry Sheet'!F32","v":0},{"$f":"'Data Entry Sheet'!G32","v":""},{"$f":"'Data Entry Sheet'!H32","v":0},{"$f":"'Data Entry Sheet'!I32","v":0},{"$f":"'Data Entry Sheet'!J32","v":" "},{"$f":"'Data Entry Sheet'!K32","v":""},null,"0 0000","---"]
[{"$f":"IF(D4 = \"\", 'Data Entry Sheet'!E12, D4)","v":0},{"$f":"IF(COUNTIF($N$1:$N$64,35)>0,VLOOKUP(35,$N$1:$Z$64,13,FALSE),\"---\")","v":"---"},{"$f":"IF(COUNTIF($N$1:$N$64,33)>0,VLOOKUP(33,$N$1:$Z$64,13,FALSE),\"---\")","v":"---"},{"$f":"IF(COUNTIF($N$1:$N$64,39)>0,VLOOKUP(39,$N$1:$Z$64,13,FALSE),\"---\")","v":"---"},{"$f":"IF(COUNTIF($N$1:$N$64,37)>0,VLOOKUP(37,$N$1:$Z$64,13,FALSE),\"---\")","v":"---"},{"$f":"IF(COUNTIF($N$1:$N$64,43)>0,VLOOKUP(43,$N$1:$Z$64,13,FALSE),\"---\")","v":"---"},{"$f":"IF(COUNTIF($N$1:$N$64,41)>0,VLOOKUP(41,$N$1:$Z$64,13,FALSE),\"---\")","v":"---"},{"$f":"IF(COUNTIF($N$1:$N$64,47)>0,VLOOKUP(47,$N$1:$Z$64,13,FALSE),\"---\")","v":"---"},{"$f":"IF(COUNTIF($N$1:$N$64,45)>0,VLOOKUP(45,$N$1:$Z$64,13,FALSE),\"---\")","v":"---"},null,null,null,null,{"$f":"'Data Entry Sheet'!B33","v":0},{"$f":"'Data Entry Sheet'!C33","v":" "},{"$f":"'Data Entry Sheet'!D33","v":0},{"$f":"'Data Entry Sheet'!E33","v":0},{"$f":"'Data Entry Sheet'!F33","v":0},{"$f":"'Data Entry Sheet'!G33","v":""},{"$f":"'Data Entry Sheet'!H33","v":0},{"$f":"'Data Entry Sheet'!I33","v":0},{"$f":"'Data Entry Sheet'!J33","v":" "},{"$f":"'Data Entry Sheet'!K33","v":""},null,"0 0000","---"]
[null,{"$f":"IF(COUNTIF($N$1:$N$64,36)>0,VLOOKUP(36,$N$1:$Z$64,12,FALSE),\"36-\")","v":"36-"},{"$f":"IF(COUNTIF($N$1:$N$64,34)>0,VLOOKUP(34,$N$1:$Z$64,12,FALSE),\"34-\")","v":"34-"},{"$f":"IF(COUNTIF($N$1:$N$64,40)>0,VLOOKUP(40,$N$1:$Z$64,12,FALSE),\"40-\")","v":"40-"},{"$f":"IF(COUNTIF($N$1:$N$64,38)>0,VLOOKUP(38,$N$1:$Z$64,12,FALSE),\"38-\")","v":"38-"},{"$f":"IF(COUNTIF($N$1:$N$64,44)>0,VLOOKUP(44,$N$1:$Z$64,12,FALSE),\"44-\")","v":"44-"},{"$f":"IF(COUNTIF($N$1:$N$64,42)>0,VLOOKUP(42,$N$1:$Z$64,12,FALSE),\"42-\")","v":"42-"},{"$f":"IF(COUNTIF($N$1:$N$64,48)>0,VLOOKUP(48,$N$1:$Z$64,12,FALSE),\"48-\")","v":"48-"},{"$f":"IF(COUNTIF($N$1:$N$64,46)>0,VLOOKUP(46,$N$1:$Z$64,12,FALSE),\"46-\")","v":"46-"},null,null,null,null,{"$f":"'Data Entry Sheet'!B34","v":0},{"$f":"'Data Entry Sheet'!C34","v":" "},{"$f":"'Data Entry Sheet'!D34","v":0},{"$f":"'Data Entry Sheet'!E34","v":0},{"$f":"'Data Entry Sheet'!F34","v":0},{"$f":"'Data Entry Sheet'!G34","v":""},{"$f":"'Data Entry Sheet'!H34","v":0},{"$f":"'Data Entry Sheet'!I34","v":0},{"$f":"'Data Entry Sheet'!J34","v":" "},{"$f":"'Data Entry Sheet'!K34","v":""},null,"0 0000","---"]
[null,{"$f":"IF(COUNTIF($N$1:$N$64,36)>0,VLOOKUP(36,$N$1:$Z$64,13,FALSE),\"---\")","v":"---"},{"$f":"IF(COUNTIF($N$1:$N$64,34)>0,VLOOKUP(34,$N$1:$Z$64,13,FALSE),\"---\")","v":"---"},{"$f":"IF(COUNTIF($N$1:$N$64,40)>0,VLOOKUP(40,$N$1:$Z$64,13,FALSE),\"---\")","v":"---"},{"$f":"IF(COUNTIF($N$1:$N$64,38)>0,VLOOKUP(38,$N$1:$Z$64,13,FALSE),\"---\")","v":"---"},{"$f":"IF(COUNTIF($N$1:$N$64,44)>0,VLOOKUP(44,$N$1:$Z$64,13,FALSE),\"---\")","v":"---"},{"$f":"IF(COUNTIF($N$1:$N$64,42)>0,VLOOKUP(42,$N$1:$Z$64,13,FALSE),\"---\")","v":"---"},{"$f":"IF(COUNTIF($N$1:$N$64,48)>0,VLOOKUP(48,$N$1:$Z$64,13,FALSE),\"---\")","v":"---"},{"$f":"IF(COUNTIF($N$1:$N$64,46)>0,VLOOKUP(46,$N$1:$Z$64,13,FALSE),\"---\")","v":"---"},null,null,null,null,{"$f":"'Data Entry Sheet'!B35","v":0},{"$f":"'Data Entry Sheet'!C35","v":" "},{"$f":"'Data Entry Sheet'!D35","v":0},{"$f":"'Data Entry Sheet'!E35","v":0},{"$f":"'Data Entry Sheet'!F35","v":0},{"$f":"'Data Entry Sheet'!G35","v":""},{"$f":"'Data Entry Sheet'!H35","v":0},{"$f":"'Data Entry Sheet'!I35","v":0},{"$f":"'Data Entry Sheet'!J35","v":" "},{"$f":"'Data Entry Sheet'!K35","v":""},null,"0 0000","---"]
[null,null,null,null,null,null,null,null,null,null,null,null,null,{"$f":"'Data Entry Sheet'!B36","v":0},{"$f":"'Data Entry Sheet'!C36","v":" "},{"$f":"'Data Entry Sheet'!D36","v":0},{"$f":"'Data Entry Sheet'!E36","v":0},{"$f":"'Data Entry Sheet'!F36","v":0},{"$f":"'Data Entry Sheet'!G36","v":""},{"$f":"'Data Entry Sheet'!H36","v":0},{"$f":"'Data Entry Sheet'!I36","v":0},{"$f":"'Data Entry Sheet'!J36","v":" "},{"$f":"'Data Entry Sheet'!K36","v":""},null,"0 0000","---"]
[{"$f":"'Data Entry Sheet'!E11 & \" -- RACK 4 (49-64)\"","v":" -- RACK 4 (49-64)"},{"$f":"IF(COUNTIF($N$1:$N$64,51)>0,VLOOKUP(51,$N$1:$Z$64,12,FALSE),\"51-\")","v":"51-"},{"$f":"IF(COUNTIF($N$1:$N$64,49)>0,VLOOKUP(49,$N$1:$Z$64,12,FALSE),\"49-\")","v":"49-"},{"$f":"IF(COUNTIF($N$1:$N$64,55)>0,VLOOKUP(55,$N$1:$Z$64,12,FALSE),\"55-\")","v":"55-"},{"$f":"IF(COUNTIF($N$1:$N$64,53)>0,VLOOKUP(53,$N$1:$Z$64,12,FALSE),\"53-\")","v":"53-"},{"$f":"IF(COUNTIF($N$1:$N$64,59)>0,VLOOKUP(59,$N$1:$Z$64,12,FALSE),\"59-\")","v":"59-"},{"$f":"IF(COUNTIF($N$1:$N$64,57)>0,VLOOKUP(57,$N$1:$Z$64,12,FALSE),\"57-\")","v":"57-"},{"$f":"IF(COUNTIF($N$1:$N$64,63)>0,VLOOKUP(63,$N$1:$Z$64,12,FALSE),\"63-\")","v":"63-"},{"$f":"IF(COUNTIF($N$1:$N$64,61)>0,VLOOKUP(61,$N$1:$Z$64,12,FALSE),\"61-\")","v":"61-"},null,null,null,null,{"$f":"'Data Entry Sheet'!B37","v":0},{"$f":"'Data Entry Sheet'!C37","v":" "},{"$f":"'Data Entry Sheet'!D37","v":0},{"$f":"'Data Entry Sheet'!E37","v":0},{"$f":"'Data Entry Sheet'!F37","v":0},{"$f":"'Data Entry Sheet'!G37","v":""},{"$f":"'Data Entry Sheet'!H37","v":0},{"$f":"'Data Entry Sheet'!I37","v":0},{"$f":"'Data Entry Sheet'!J37","v":" "},{"$f":"'Data Entry Sheet'!K37","v":""},null,"0 0000","---"]
[{"$f":"IF(E4 = \"\", 'Data Entry Sheet'!E12, E4)","v":0},{"$f":"IF(COUNTIF($N$1:$N$64,51)>0,VLOOKUP(51,$N$1:$Z$64,13,FALSE),\"---\")","v":"---"},{"$f":"IF(COUNTIF($N$1:$N$64,49)>0,VLOOKUP(49,$N$1:$Z$64,13,FALSE),\"---\")","v":"---"},{"$f":"IF(COUNTIF($N$1:$N$64,55)>0,VLOOKUP(55,$N$1:$Z$64,13,FALSE),\"---\")","v":"---"},{"$f":"IF(COUNTIF($N$1:$N$64,53)>0,VLOOKUP(53,$N$1:$Z$64,13,FALSE),\"---\")","v":"---"},{"$f":"IF(COUNTIF($N$1:$N$64,59)>0,VLOOKUP(59,$N$1:$Z$64,13,FALSE),\"---\")","v":"---"},{"$f":"IF(COUNTIF($N$1:$N$64,57)>0,VLOOKUP(57,$N$1:$Z$64,13,FALSE),\"---\")","v":"---"},{"$f":"IF(COUNTIF($N$1:$N$64,63)>0,VLOOKUP(63,$N$1:$Z$64,13,FALSE),\"---\")","v":"---"},{"$f":"IF(COUNTIF($N$1:$N$64,61)>0,VLOOKUP(61,$N$1:$Z$64,13,FALSE),\"---\")","v":"---"},null,null,null,null,{"$f":"'Data Entry Sheet'!B38","v":0},{"$f":"'Data Entry Sheet'!C38","v":" "},{"$f":"'Data Entry Sheet'!D38","v":0},{"$f":"'Data Entry Sheet'!E38","v":0},{"$f":"'Data Entry Sheet'!F38","v":0},{"$f":"'Data Entry Sheet'!G38","v":""},{"$f":"'Data Entry Sheet'!H38","v":0},{"$f":"'Data Entry Sheet'!I38","v":0},{"$f":"'Data Entry Sheet'!J38","v":" "},{"$f":"'Data Entry Sheet'!K38","v":""},null,"0 0000","---"]
[null,{"$f":"IF(COUNTIF($N$1:$N$64,52)>0,VLOOKUP(52,$N$1:$Z$64,12,FALSE),\"52-\")","v":"52-"},{"$f":"IF(COUNTIF($N$1:$N$64,50)>0,VLOOKUP(50,$N$1:$Z$64,12,FALSE),\"50-\")","v":"50-"},{"$f":"IF(COUNTIF($N$1:$N$64,56)>0,VLOOKUP(56,$N$1:$Z$64,12,FALSE),\"56-\")","v":"56-"},{"$f":"IF(COUNTIF($N$1:$N$64,54)>0,VLOOKUP(54,$N$1:$Z$64,12,FALSE),\"54-\")","v":"54-"},{"$f":"IF(COUNTIF($N$1:$N$64,60)>0,VLOOKUP(60,$N$1:$Z$64,12,FALSE),\"60-\")","v":"60-"},{"$f":"IF(COUNTIF($N$1:$N$64,58)>0,VLOOKUP(58,$N$1:$Z$64,12,FALSE),\"58-\")","v":"58-"},{"$f":"IF(COUNTIF($N$1:$N$64,64)>0,VLOOKUP(64,$N$1:$Z$64,12,FALSE),\"64-\")","v":"64-"},{"$f":"IF(COUNTIF($N$1:$N$64,62)>0,VLOOKUP(62,$N$1:$Z$64,12,FALSE),\"62-\")","v":"62-"},null,null,null,null,{"$f":"'Data Entry Sheet'!B39","v":0},{"$f":"'Data Entry Sheet'!C39","v":" "},{"$f":"'Data Entry Sheet'!D39","v":0},{"$f":"'Data Entry Sheet'!E39","v":0},{"$f":"'Data Entry Sheet'!F39","v":0},{"$f":"'Data Entry Sheet'!G39","v":""},{"$f":"'Data Entry Sheet'!H39","v":0},{"$f":"'Data Entry Sheet'!I39","v":0},{"$f":"'Data Entry Sheet'!J39","v":" "},{"$f":"'Data Entry Sheet'!K39","v":""},null,"0 0000","---"]
[null,{"$f":"IF(COUNTIF($N$1:$N$64,52)>0,VLOOKUP(52,$N$1:$Z$64,13,FALSE),\"---\")","v":"---"},{"$f":"IF(COUNTIF($N$1:$N$64,50)>0,VLOOKUP(50,$N$1:$Z$64,13,FALSE),\"---\")","v":"---"},{"$f":"IF(COUNTIF($N$1:$N$64,56)>0,VLOOKUP(56,$N$1:$Z$64,13,FALSE),\"---\")","v":"---"},{"$f":"IF(COUNTIF($N$1:$N$64,54)>0,VLOOKUP(54,$N$1:$Z$64,13,FALSE),\"---\")","v":"---"},{"$f":"IF(COUNTIF($N$1:$N$64,60)>0,VLOOKUP(60,$N$1:$Z$64,13,FALSE),\"---\")","v":"---"},{"$f":"IF(COUNTIF($N$1:$N$64,58)>0,VLOOKUP(58,$N$1:$Z$64,13,FALSE),\"---\")","v":"---"},{"$f":"IF(COUNTIF($N$1:$N$64,64)>0,VLOOKUP(64,$N$1:$Z$64,13,FALSE),\"---\")","v":"---"},{"$f":"IF(COUNTIF($N$1:$N$64,62)>0,VLOOKUP(62,$N$1:$Z$64,13,FALSE),\"---\")","v":"---"},null,null,null,null,{"$f":"'Data Entry Sheet'!B40","v":0},{"$f":"'Data Entry Sheet'!C40","v":" "},{"$f":"'Data Entry Sheet'!D40","v":0},{"$f":"'Data Entry Sheet'!E40","v":0},{"$f":"'Data Entry Sheet'!F40","v":0},{"$f":"'Data Entry Sheet'!G40","v":""},{"$f":"'Data Entry Sheet'!H40","v":0},{"$f":"'Data Entry Sheet'!I40","v":0},{"$f":"'Data Entry Sheet'!J40","v":" "},{"$f":"'Data Entry Sheet'!K40","v":""},null,"0 0000","---"]
[null,null,null,null,null,null,null,null,null,null,null,null,null,{"$f":"'Data Entry Sheet'!B41","v":0},{"$f":"'Data Entry Sheet'!C41","v":" "},{"$f":"'Data Entry Sheet'!D41","v":0},{"$f":"'Data Entry Sheet'!E41","v":0},{"$f":"'Data Entry Sheet'!F41","v":0},{"$f":"'Data Entry Sheet'!G41","v":""},{"$f":"'Data Entry Sheet'!H41","v":0},{"$f":"'Data Entry Sheet'!I41","v":0},{"$f":"'Data Entry Sheet'!J41","v":" "},{"$f":"'Data Entry Sheet'!K41","v":""},null,"0 0000","---"]
[null,null,null,null,null,null,null,null,null,null,null,null,null,{"$f":"'Data Entry Sheet'!B42","v":0},{"$f":"'Data Entry Sheet'!C42","v":" "},{"$f":"'Data Entry Sheet'!D42","v":0},{"$f":"'Data Entry Sheet'!E42","v":0},{"$f":"'Data Entry Sheet'!F42","v":0},{"$f":"'Data Entry Sheet'!G42","v":""},{"$f":"'Data Entry Sheet'!H42","v":0},{"$f":"'Data Entry Sheet'!I42","v":0},{"$f":"'Data Entry Sheet'!J42","v":" "},{"$f":"'Data Entry Sheet'!K42","v":""},null,"0 0000","---"]
[null,null,null,null,null,null,null,null,null,null,null,null,null,{"$f":"'Data Entry Sheet'!B43","v":0},{"$f":"'Data Entry Sheet'!C43","v":" "},{"$f":"'Data Entry Sheet'!D43","v":0},{"$f":"'Data Entry Sheet'!E43","v":0},{"$f":"'Data Entry Sheet'!F43","v":0},{"$f":"'Data Entry Sheet'!G43","v":""},{"$f":"'Data Entry Sheet'!H43","v":0},{"$f":"'Data Entry Sheet'!I43","v":0},{"$f":"'Data Entry Sheet'!J43","v":" "},{"$f":"'Data Entry Sheet'!K43","v":""},null,"0 0000","---"]
[null,null,null,null,null,null,null,null,null,null,null,null,null,{"$f":"'Data Entry Sheet'!B44","v":0},{"$f":"'Data Entry Sheet'!C44","v":" "},{"$f":"'Data Entry Sheet'!D44","v":0},{"$f":"'Data Entry Sheet'!E44","v":0},{"$f":"'Data Entry Sheet'!F44","v":0},{"$f":"'Data Entry Sheet'!G44","v":""},{"$f":"'Data Entry Sheet'!H44","v":0},{"$f":"'Data Entry Sheet'!I44","v":0},{"$f":"'Data Entry Sheet'!J44","v":" "},{"$f":"'Data Entry Sheet'!K44","v":""},null,"0 0000","---"]
[null,null,null,null,null,null,null,null,null,null,null,null,null,{"$f":"'Data Entry Sheet'!B45","v":0},{"$f":"'Data Entry Sheet'!C45","v":" "},{"$f":"'Data Entry Sheet'!D45","v":0},{"$f":"'Data Entry Sheet'!E45","v":0},{"$f":"'Data Entry Sheet'!F45","v":0},{"$f":"'Data Entry Sheet'!G45","v":""},{"$f":"'Data Entry Sheet'!H45","v":0},{"$f":"'Data Entry Sheet'!I45","v":0},{"$f":"'Data Entry Sheet'!J45","v":" "},{"$f":"'Data Entry Sheet'!K45","v":""},null,"0 0000","---"]
[null,null,null,null,null,null,null,null,null,null,null,null,null,{"$f":"'Data Entry Sheet'!B46","v":0},{"$f":"'Data Entry Sheet'!C46","v":" "},{"$f":"'Data Entry Sheet'!D46","v":0},{"$f":"'Data Entry Sheet'!E46","v":0},{"$f":"'Data Entry Sheet'!F46","v":0},{"$f":"'Data Entry Sheet'!G46","v":""},{"$f":"'Data Entry Sheet'!H46","v":0},{"$f":"'Data Entry Sheet'!I46","v":0},{"$f":"'Data Entry Sheet'!J46","v":" "},{"$f":"'Data Entry Sheet'!K46","v":""},null,"0 0000","---"]
[null,null,null,null,null,null,null,null,null,null,null,null,null,{"$f":"'Data Entry Sheet'!B47","v":0},{"$f":"'Data Entry Sheet'!C47","v":" "},{"$f":"'Data Entry Sheet'!D47","v":0},{"$f":"'Data Entry Sheet'!E47","v":0},{"$f":"'Data Entry Sheet'!F47","v":0},{"$f":"'Data Entry Sheet'!G47","v":""},{"$f":"'Data Entry Sheet'!H47","v":0},{"$f":"'Data Entry Sheet'!I47","v":0},{"$f":"'Data Entry Sheet'!J47","v":" "},{"$f":"'Data Entry Sheet'!K47","v":""},null,"0 0000","---"]
[null,null,null,null,null,null,null,null,null,null,null,null,null,{"$f":"'Data Entry Sheet'!B48","v":0},{"$f":"'Data Entry Sheet'!C48","v":" "},{"$f":"'Data Entry Sheet'!D48","v":0},{"$f":"'Data Entry Sheet'!E48","v":0},{"$f":"'Data Entry Sheet'!F48","v":0},{"$f":"'Data Entry Sheet'!G48","v":""},{"$f":"'Data Entry Sheet'!H48","v":0},{"$f":"'Data Entry Sheet'!I48","v":0},{"$f":"'Data Entry Sheet'!J48","v":" "},{"$f":"'Data Entry Sheet'!K48","v":""},null,"0 0000","---"]
[null,null,null,null,null,null,null,null,null,null,null,null,null,{"$f":"'Data Entry Sheet'!B49","v":0},{"$f":"'Data Entry Sheet'!C49","v":" "},{"$f":"'Data Entry Sheet'!D49","v":0},{"$f":"'Data Entry Sheet'!E49","v":0},{"$f":"'Data Entry Sheet'!F49","v":0},{"$f":"'Data Entry Sheet'!G49","v":""},{"$f":"'Data Entry Sheet'!H49","v":0},{"$f":"'Data Entry Sheet'!I49","v":0},{"$f":"'Data Entry Sheet'!J49","v":" "},{"$f":"'Data Entry Sheet'!K49","v":""},null,"0 0000","---"]
[null,null,null,null,null,null,null,null,null,null,null,null,null,{"$f":"'Data Entry Sheet'!B50","v":0},{"$f":"'Data Entry Sheet'!C50","v":" "},{"$f":"'Data Entry Sheet'!D50","v":0},{"$f":"'Data Entry Sheet'!E50","v":0},{"$f":"'Data Entry Sheet'!F50","v":0},{"$f":"'Data Entry Sheet'!G50","v":""},{"$f":"'Data Entry Sheet'!H50","v":0},{"$f":"'Data Entry Sheet'!I50","v":0},{"$f":"'Data Entry Sheet'!J50","v":" "},{"$f":"'Data Entry Sheet'!K50","v":""},null,"0 0000","---"]
[null,null,null,null,null,null,null,null,null,null,null,null,null,{"$f":"'Data Entry Sheet'!B51","v":0},{"$f":"'Data Entry Sheet'!C51","v":" "},{"$f":"'Data Entry Sheet'!D51","v":0},{"$f":"'Data Entry Sheet'!E51","v":0},{"$f":"'Data Entry Sheet'!F51","v":0},{"$f":"'Data Entry Sheet'!G51","v":""},{"$f":"'Data Entry Sheet'!H51","v":0},{"$f":"'Data Entry Sheet'!I51","v":0},{"$f":"'Data Entry Sheet'!J51","v":" "},{"$f":"'Data Entry Sheet'!K51","v":""},null,"0 0000","---"]
[null,null,null,null,null,null,null,null,null,null,null,null,null,{"$f":"'Data Entry Sheet'!B52","v":0},{"$f":"'Data Entry Sheet'!C52","v":" "},{"$f":"'Data Entry Sheet'!D52","v":0},{"$f":"'Data Entry Sheet'!E52","v":0},{"$f":"'Data Entry Sheet'!F52","v":0},{"$f":"'Data Entry Sheet'!G52","v":""},{"$f":"'Data Entry Sheet'!H52","v":0},{"$f":"'Data Entry Sheet'!I52","v":0},{"$f":"'Data Entry Sheet'!J52","v":" "},{"$f":"'Data Entry Sheet'!K52","v":""},null,"0 0000","---"]
[null,null,null,null,null,null,null,null,null,null,null,null,null,{"$f":"'Data Entry Sheet'!B53","v":0},{"$f":"'Data Entry Sheet'!C53","v":" "},{"$f":"'Data Entry Sheet'!D53","v":0},{"$f":"'Data Entry Sheet'!E53","v":0},{"$f":"'Data Entry Sheet'!F53","v":0},{"$f":"'Data Entry Sheet'!G53","v":""},{"$f":"'Data Entry Sheet'!H53","v":0},{"$f":"'Data Entry Sheet'!I53","v":0},{"$f":"'Data Entry Sheet'!J53","v":" "},{"$f":"'Data Entry Sheet'!K53","v":""},null,"0 0000","---"]
[null,null,null,null,null,null,null,null,null,null,null,null,null,{"$f":"'Data Entry Sheet'!B54","v":0},{"$f":"'Data Entry Sheet'!C54","v":" "},{"$f":"'Data Entry Sheet'!D54","v":0},{"$f":"'Data Entry Sheet'!E54","v":0},{"$f":"'Data Entry Sheet'!F54","v":0},{"$f":"'Data Entry Sheet'!G54","v":""},{"$f":"'Data Entry Sheet'!H54","v":0},{"$f":"'Data Entry Sheet'!I54","v":0},{"$f":"'Data Entry Sheet'!J54","v":" "},{"$f":"'Data Entry Sheet'!K54","v":""},null,"0 0000","---"]
[null,null,null,null,null,null,null,null,null,null,null,null,null,{"$f":"'Data Entry Sheet'!B55","v":0},{"$f":"'Data Entry Sheet'!C55","v":" "},{"$f":"'Data Entry Sheet'!D55","v":0},{"$f":"'Data Entry Sheet'!E55","v":0},{"$f":"'Data Entry Sheet'!F55","v":0},{"$f":"'Data Entry Sheet'!G55","v":""},{"$f":"'Data Entry Sheet'!H55","v":0},{"$f":"'Data Entry Sheet'!I55","v":0},{"$f":"'Data Entry Sheet'!J55","v":" "},{"$f":"'Data Entry Sheet'!K55","v":""},null,"0 0000","---"]
[null,null,null,null,null,null,null,null,null,null,null,null,null,{"$f":"'Data Entry Sheet'!B56","v":0},{"$f":"'Data Entry Sheet'!C56","v":" "},{"$f":"'Data Entry Sheet'!D56","v":0},{"$f":"'Data Entry Sheet'!E56","v":0},{"$f":"'Data Entry Sheet'!F56","v":0},{"$f":"'Data Entry Sheet'!G56","v":""},{"$f":"'Data Entry Sheet'!H56","v":0},{"$f":"'Data Entry Sheet'!I56","v":0},{"$f":"'Data Entry Sheet'!J56","v":" "},{"$f":"'Data Entry Sheet'!K56","v":""},null,"0 0000","---"]
[null,null,null,null,null,null,null,null,null,null,null,null,null,{"$f":"'Data Entry Sheet'!B57","v":0},{"$f":"'Data Entry Sheet'!C57","v":" "},{"$f":"'Data Entry Sheet'!D57","v":0},{"$f":"'Data Entry Sheet'!E57","v":0},{"$f":"'Data Entry Sheet'!F57","v":0},{"$f":"'Data Entry Sheet'!G57","v":""},{"$f":"'Data Entry Sheet'!H57","v":0},{"$f":"'Data Entry Sheet'!I57","v":0},{"$f":"'Data Entry Sheet'!J57","v":" "},{"$f":"'Data Entry Sheet'!K57","v":""},null,"0 0000","---"]
[null,null,null,null,null,null,null,null,null,null,null,null,null,{"$f":"'Data Entry Sheet'!B58","v":0},{"$f":"'Data Entry Sheet'!C58","v":" "},{"$f":"'Data Entry Sheet'!D58","v":0},{"$f":"'Data Entry Sheet'!E58","v":0},{"$f":"'Data Entry Sheet'!F58","v":0},{"$f":"'Data Entry Sheet'!G58","v":""},{"$f":"'Data Entry Sheet'!H58","v":0},{"$f":"'Data Entry Sheet'!I58","v":0},{"$f":"'Data Entry Sheet'!J58","v":" "},{"$f":"'Data Entry Sheet'!K58","v":""},null,"0 0000","---"]
[null,null,null,null,null,null,null,null,null,null,null,null,null,{"$f":"'Data Entry Sheet'!B59","v":0},{"$f":"'Data Entry Sheet'!C59","v":" "},{"$f":"'Data Entry Sheet'!D59","v":0},{"$f":"'Data Entry Sheet'!E59","v":0},{"$f":"'Data Entry Sheet'!F59","v":0},{"$f":"'Data Entry Sheet'!G59","v":""},{"$f":"'Data Entry Sheet'!H59","v":0},{"$f":"'Data Entry Sheet'!I59","v":0},{"$f":"'Data Entry Sheet'!J59","v":" "},{"$f":"'Data Entry Sheet'!K59","v":""},null,"0 0000","---"]
[null,null,null,null,null,null,null,null,null,null,null,null,null,{"$f":"'Data Entry Sheet'!B60","v":0},{"$f":"'Data Entry Sheet'!C60","v":" "},{"$f":"'Data Entry Sheet'!D60","v":0},{"$f":"'Data Entry Sheet'!E60","v":0},{"$f":"'Data Entry Sheet'!F60","v":0},{"$f":"'Data Entry Sheet'!G60","v":""},{"$f":"'Data Entry Sheet'!H60","v":0},{"$f":"'Data Entry Sheet'!I60","v":0},{"$f":"'Data Entry Sheet'!J60","v":" "},{"$f":"'Data Entry Sheet'!K60","v":""},null,"0 0000","---"]
[null,null,null,null,null,null,null,null,null,null,null,null,null,{"$f":"'Data Entry Sheet'!B61","v":0},{"$f":"'Data Entry Sheet'!C61","v":" "},{"$f":"'Data Entry Sheet'!D61","v":0},{"$f":"'Data Entry Sheet'!E61","v":0},{"$f":"'Data Entry Sheet'!F61","v":0},{"$f":"'Data Entry Sheet'!G61","v":""},{"$f":"'Data Entry Sheet'!H61","v":0},{"$f":"'Data Entry Sheet'!I61","v":0},{"$f":"'Data Entry Sheet'!J61","v":" "},{"$f":"'Data Entry Sheet'!K61","v":""},null,"0 0000","---"]
[null,null,null,null,null,null,null,null,null,null,null,null,null,{"$f":"'Data Entry Sheet'!B62","v":0},{"$f":"'Data Entry Sheet'!C62","v":" "},{"$f":"'Data Entry Sheet'!D62","v":0},{"$f":"'Data Entry Sheet'!E62","v":0},{"$f":"'Data Entry Sheet'!F62","v":0},{"$f":"'Data Entry Sheet'!G62","v":""},{"$f":"'Data Entry Sheet'!H62","v":0},{"$f":"'Data Entry Sheet'!I62","v":0},{"$f":"'Data Entry Sheet'!J62","v":" "},{"$f":"'Data Entry Sheet'!K62","v":""},null,"0 0000","---"]
[null,null,null,null,null,null,null,null,null,null,null,null,null,{"$f":"'Data Entry Sheet'!B63","v":0},{"$f":"'Data Entry Sheet'!C63","v":" "},{"$f":"'Data Entry Sheet'!D63","v":0},{"$f":"'Data Entry Sheet'!E63","v":0},{"$f":"'Data Entry Sheet'!F63","v":0},{"$f":"'Data Entry Sheet'!G63","v":""},{"$f":"'Data Entry Sheet'!H63","v":0},{"$f":"'Data Entry Sheet'!I63","v":0},{"$f":"'Data Entry Sheet'!J63","v":" "},{"$f":"'Data Entry Sheet'!K63","v":""},null,"0 0000","---"]
[null,null,null,null,null,null,null,null,null,null,null,null,null,{"$f":"'Data Entry Sheet'!B64","v":0},{"$f":"'Data Entry Sheet'!C64","v":" "},{"$f":"'Data Entry Sheet'!D64","v":0},{"$f":"'Data Entry Sheet'!E64","v":0},{"$f":"'Data Entry Sheet'!F64","v":0},{"$f":"'Data Entry Sheet'!G64","v":""},{"$f":"'Data Entry Sheet'!H64","v":0},{"$f":"'Data Entry Sheet'!I64","v":0},{"$f":"'Data Entry Sheet'!J64","v":" "},{"$f":"'Data Entry Sheet'!K64","v":""},null,"0 0000","---"]
[null,null,null,null,null,null,null,null,null,null,null,null,null,{"$f":"'Data Entry Sheet'!B65","v":0},{"$f":"'Data Entry Sheet'!C65","v":" "},{"$f":"'Data Entry Sheet'!D65","v":0},{"$f":"'Data Entry Sheet'!E65","v":0},{"$f":"'Data Entry Sheet'!F65","v":0},{"$f":"'Data Entry Sheet'!G65","v":""},{"$f":"'Data Entry Sheet'!H65","v":0},{"$f":"'Data Entry Sheet'!I65","v":0},{"$f":"'Data Entry Sheet'!J65","v":" "},{"$f":"'Data Entry Sheet'!K65","v":""},null,"0 0000","---"]
[null,null,null,null,null,null,null,null,null,null,null,null,null,{"$f":"'Data Entry Sheet'!B66","v":0},{"$f":"'Data Entry Sheet'!C66","v":" "},{"$f":"'Data Entry Sheet'!D66","v":0},{"$f":"'Data Entry Sheet'!E66","v":0},{"$f":"'Data Entry Sheet'!F66","v":0},{"$f":"'Data Entry Sheet'!G66","v":""},{"$f":"'Data Entry Sheet'!H66","v":0},{"$f":"'Data Entry Sheet'!I66","v":0},{"$f":"'Data Entry Sheet'!J66","v":" "},{"$f":"'Data Entry Sheet'!K66","v":""},null,"0 0000","---"]
[null,null,null,null,null,null,null,null,null,null,null,null,null,{"$f":"'Data Entry Sheet'!B67","v":0},{"$f":"'Data Entry Sheet'!C67","v":" "},{"$f":"'Data Entry Sheet'!D67","v":0},{"$f":"'Data Entry Sheet'!E67","v":0},{"$f":"'Data Entry Sheet'!F67","v":0},{"$f":"'Data Entry Sheet'!G67","v":""},{"$f":"'Data Entry Sheet'!H67","v":0},{"$f":"'Data Entry Sheet'!I67","v":0},{"$f":"'Data Entry Sheet'!J67","v":" "},{"$f":"'Data Entry Sheet'!K67","v":""},null,"0 0000","---"]
[null,null,null,null,null,null,null,null,null,null,null,null,null,{"$f":"'Data Entry Sheet'!B68","v":0},{"$f":"'Data Entry Sheet'!C68","v":" "},{"$f":"'Data Entry Sheet'!D68","v":0},{"$f":"'Data Entry Sheet'!E68","v":0},{"$f":"'Data Entry Sheet'!F68","v":0},{"$f":"'Data Entry Sheet'!G68","v":""},{"$f":"'Data Entry Sheet'!H68","v":0},{"$f":"'Data Entry Sheet'!I68","v":0},{"$f":"'Data Entry Sheet'!J68","v":" "},{"$f":"'Data Entry Sheet'!K68","v":""},null,"0 0000","---"]
[null,null,null,null,null,null,null,null,null,null,null,null,null,{"$f":"'Data Entry Sheet'!B69","v":0},{"$f":"'Data Entry Sheet'!C69","v":" "},{"$f":"'Data Entry Sheet'!D69","v":0},{"$f":"'Data Entry Sheet'!E69","v":0},{"$f":"'Data Entry Sheet'!F69","v":0},{"$f":"'Data Entry Sheet'!G69","v":""},{"$f":"'Data Entry Sheet'!H69","v":0},{"$f":"'Data Entry Sheet'!I69","v":0},{"$f":"'Data Entry Sheet'!J69","v":" "},{"$f":"'Data Entry Sheet'!K69","v":""},null,"0 0000","---"]
[null,null,null,null,null,null,null,null,null,null,null,null,null,{"$f":"'Data Entry Sheet'!B70","v":0},{"$f":"'Data Entry Sheet'!C70","v":" "},{"$f":"'Data Entry Sheet'!D70","v":0},{"$f":"'Data Entry Sheet'!E70","v":0},{"$f":"'Data Entry Sheet'!F70","v":0},{"$f":"'Data Entry Sheet'!G70","v":""},{"$f":"'Data Entry Sheet'!H70","v":0},{"$f":"'Data Entry Sheet'!I70","v":0},{"$f":"'Data Entry Sheet'!J70","v":" "},{"$f":"'Data Entry Sheet'!K70","v":""},null,"0 0000","---"]
[null,null,null,null,null,null,null,null,null,null,null,null,null,{"$f":"'Data Entry Sheet'!B71","v":0},{"$f":"'Data Entry Sheet'!C71","v":" "},{"$f":"'Data Entry Sheet'!D71","v":0},{"$f":"'Data Entry Sheet'!E71","v":0},{"$f":"'Data Entry Sheet'!F71","v":0},{"$f":"'Data Entry Sheet'!G71","v":""},{"$f":"'Data Entry Sheet'!H71","v":0},{"$f":"'Data Entry Sheet'!I71","v":0},{"$f":"'Data Entry Sheet'!J71","v":" "},{"$f":"'Data Entry Sheet'!K71","v":""},null,"0 0000","---"]
[null,null,null,null,null,null,null,null,null,null,null,null,null,{"$f":"'Data Entry Sheet'!B72","v":0},{"$f":"'Data Entry Sheet'!C72","v":" "},{"$f":"'Data Entry Sheet'!D72","v":0},{"$f":"'Data Entry Sheet'!E72","v":0},{"$f":"'Data Entry Sheet'!F72","v":0},{"$f":"'Data Entry Sheet'!G72","v":""},{"$f":"'Data Entry Sheet'!H72","v":0},{"$f":"'Data Entry Sheet'!I72","v":0},{"$f":"'Data Entry Sheet'!J72","v":" "},{"$f":"'Data Entry Sheet'!K72","v":""},null,"0 0000","---"]
[null,null,null,null,null,null,null,null,null,null,null,null,null,{"$f":"'Data Entry Sheet'!B73","v":0},{"$f":"'Data Entry Sheet'!C73","v":" "},{"$f":"'Data Entry Sheet'!D73","v":0},{"$f":"'Data Entry Sheet'!E73","v":0},{"$f":"'Data Entry Sheet'!F73","v":0},{"$f":"'Data Entry Sheet'!G73","v":""},{"$f":"'Data Entry Sheet'!H73","v":0},{"$f":"'Data Entry Sheet'!I73","v":0},{"$f":"'Data Entry Sheet'!J73","v":" "},{"$f":"'Data Entry Sheet'!K73","v":""},null,"0 0000","---"]
[null,null,null,null,null,null,null,null,null,null,null,null,null,{"$f":"'Data Entry Sheet'!B74","v":0},{"$f":"'Data Entry Sheet'!C74","v":" "},{"$f":"'Data Entry Sheet'!D74","v":0},{"$f":"'Data Entry Sheet'!E74","v":0},{"$f":"'Data Entry Sheet'!F74","v":0},{"$f":"'Data Entry Sheet'!G74","v":""},{"$f":"'Data Entry Sheet'!H74","v":0},{"$f":"'Data Entry Sheet'!I74","v":0},{"$f":"'Data Entry Sheet'!J74","v":" "},{"$f":"'Data Entry Sheet'!K74","v":""},null,"0 0000","---"]
[null,null,null,null,null,null,null,null,null,null,null,null,null,{"$f":"'Data Entry Sheet'!B75","v":0},{"$f":"'Data Entry Sheet'!C75","v":" "},{"$f":"'Data Entry Sheet'!D75","v":0},{"$f":"'Data Entry Sheet'!E75","v":0},{"$f":"'Data Entry Sheet'!F75","v":0},{"$f":"'Data Entry Sheet'!G75","v":""},{"$f":"'Data Entry Sheet'!H75","v":0},{"$f":"'Data Entry Sheet'!I75","v":0},{"$f":"'Data Entry Sheet'!J75","v":" "},{"$f":"'Data Entry Sheet'!K75","v":""},null,"0 0000","---"]
[null,null,null,null,null,null,null,null,null,null,null,null,null,{"$f":"'Data Entry Sheet'!B76","v":0},{"$f":"'Data Entry Sheet'!C76","v":" "},{"$f":"'Data Entry Sheet'!D76","v":0},{"$f":"'Data Entry Sheet'!E76","v":0},{"$f":"'Data Entry Sheet'!F76","v":0},{"$f":"'Data Entry Sheet'!G76","v":""},{"$f":"'Data Entry Sheet'!H76","v":0},{"$f":"'Data Entry Sheet'!I76","v":0},{"$f":"'Data Entry Sheet'!J76","v":" "},{"$f":"'Data Entry Sheet'!K76","v":""},null,"0 0000","---"]
[null,null,null,null,null,null,null,null,null,null,null,null,null,{"$f":"'Data Entry Sheet'!B77","v":0},{"$f":"'Data Entry Sheet'!C77","v":" "},{"$f":"'Data Entry Sheet'!D77","v":0},{"$f":"'Data Entry Sheet'!E77","v":0},{"$f":"'Data Entry Sheet'!F77","v":0},{"$f":"'Data Entry Sheet'!G77","v":""},{"$f":"'Data Entry Sheet'!H77","v":0},{"$f":"'Data Entry Sheet'!I77","v":0},{"$f":"'Data Entry Sheet'!J77","v":" "},{"$f":"'Data Entry Sheet'!K77","v":""},null,"0 0000","---"]
[null,null,null,null,null,null,null,null,null,null,null,null,null,{"$f":"'Data Entry Sheet'!B78","v":0},{"$f":"'Data Entry Sheet'!C78","v":" "},{"$f":"'Data Entry Sheet'!D78","v":0},{"$f":"'Data Entry Sheet'!E78","v":0},{"$f":"'Data Entry Sheet'!F78","v":0},{"$f":"'Data Entry Sheet'!G78","v":""},{"$f":"'Data Entry Sheet'!H78","v":0},{"$f":"'Data Entry Sheet'!I78","v":0},{"$f":"'Data Entry Sheet'!J78","v":" "},{"$f":"'Data Entry Sheet'!K78","v":""},null,"0 0000","---"]
[null,null,null,null,null,null,null,null,null,null,null,null,null,{"$f":"'Data Entry Sheet'!B79","v":0},{"$f":"'Data Entry Sheet'!C79","v":" "},{"$f":"'Data Entry Sheet'!D79","v":0},{"$f":"'Data Entry Sheet'!E79","v":0},{"$f":"'Data Entry Sheet'!F79","v":0},{"$f":"'Data Entry Sheet'!G79","v":""},{"$f":"'Data Entry Sheet'!H79","v":0},{"$f":"'Data Entry Sheet'!I79","v":0},{"$f":"'Data Entry Sheet'!J79","v":" "},{"$f":"'Data Entry Sheet'!K79","v":""},null,"0 0000","---"]
[null,null,null,null,null,null,null,null,null,null,null,null,null,{"$f":"'Data Entry Sheet'!B80","v":0},{"$f":"'Data Entry Sheet'!C80","v":" "},{"$f":"'Data Entry Sheet'!D80","v":0},{"$f":"'Data Entry Sheet'!E80","v":0},{"$f":"'Data Entry Sheet'!F80","v":0},{"$f":"'Data Entry Sheet'!G80","v":""},{"$f":"'Data Entry Sheet'!H80","v":0},{"$f":"'Data Entry Sheet'!I80","v":0},{"$f":"'Data Entry Sheet'!J80","v":" "},{"$f":"'Data Entry Sheet'!K80","v":""},null,"0 0000","---"]

{"sheet":"Dymo 450 Lead-In Labels","index":2,"n_rows":66,"n_cols":37,"rows_kept":66,"cut":false,"hidden":false,"merged":[]}
[]
[null," Select"]
[null,"x",null,{"$f":"'Data Entry Sheet'!B17 & 'Data Entry Sheet'!C17 & 'Data Entry Sheet'!D17 & 'Data Entry Sheet'!E17 & 'Data Entry Sheet'!F17","v":" "},{"$f":"'Data Entry Sheet'!H17","v":0},null,null,null,null,null,null,null,null,"1-16",null,null,1,null,{"$f":"'Data Entry Sheet'!B17","v":0},{"$f":"'Data Entry Sheet'!C17","v":" "},{"$f":"'Data Entry Sheet'!D17","v":0},{"$f":"'Data Entry Sheet'!E17","v":0},{"$f":"'Data Entry Sheet'!F17","v":0},{"$f":"'Data Entry Sheet'!G17","v":""},{"$f":"'Data Entry Sheet'!H17","v":0},{"$f":"'Data Entry Sheet'!I17","v":0},{"$f":"'Data Entry Sheet'!J17","v":" "},{"$f":"'Data Entry Sheet'!K17","v":""},null,{"$f":"S3&T3&U3&V3&W3&X3&Y3","v":"0 0000"},{"$f":"IF(Z3 = \"C\", Z3&AA3&AB3, \"---\")","v":"---"},null,{"$f":"MAX(S3:S66)","v":0},null,"32-WA8",null,"32-WA8"]
[null,"x",null,{"$f":"'Data Entry Sheet'!B18 & 'Data Entry Sheet'!C18 & 'Data Entry Sheet'!D18 & 'Data Entry Sheet'!E18 & 'Data Entry Sheet'!F18","v":" "},{"$f":"'Data Entry Sheet'!H18","v":0},null,null,null,null,null,null,null,null,"17-32",null,null,2,null,{"$f":"'Data Entry Sheet'!B18","v":0},{"$f":"'Data Entry Sheet'!C18","v":" "},{"$f":"'Data Entry Sheet'!D18","v":0},{"$f":"'Data Entry Sheet'!E18","v":0},{"$f":"'Data Entry Sheet'!F18","v":0},{"$f":"'Data Entry Sheet'!G18","v":""},{"$f":"'Data Entry Sheet'!H18","v":0},{"$f":"'Data Entry Sheet'!I18","v":0},{"$f":"'Data Entry Sheet'!J18","v":" "},{"$f":"'Data Entry Sheet'!K18","v":""},null,{"$f":"S4&T4&U4&V4&W4&X4&Y4","v":"0 0000"},{"$f":"IF(Z4 = \"C\", Z4&AA4&AB4, \"---\")","v":"---"},null,null,null,"2,3,4",null,"2,3,4"]
[null,"x",null,{"$f":"'Data Entry Sheet'!B19 & 'Data Entry Sheet'!C19 & 'Data Entry Sheet'!D19 & 'Data Entry Sheet'!E19 & 'Data Entry Sheet'!F19","v":" "},{"$f":"'Data Entry Sheet'!H19","v":0},null,null,null,null,null,null,null,null,"33-48",null,null,3,null,{"$f":"'Data Entry Sheet'!B19","v":0},{"$f":"'Data Entry Sheet'!C19","v":" "},{"$f":"'Data Entry Sheet'!D19","v":0},{"$f":"'Data Entry Sheet'!E19","v":0},{"$f":"'Data Entry Sheet'!F19","v":0},{"$f":"'Data Entry Sheet'!G19","v":""},{"$f":"'Data Entry Sheet'!H19","v":0},{"$f":"'Data Entry Sheet'!I19","v":0},{"$f":"'Data Entry Sheet'!J19","v":" "},{"$f":"'Data Entry Sheet'!K19","v":""},null,"0 0000","---"]
[null,"x",null,{"$f":"'Data Entry Sheet'!B20 & 'Data Entry Sheet'!C20 & 'Data Entry Sheet'!D20 & 'Data Entry Sheet'!E20 & 'Data Entry Sheet'!F20","v":" "},{"$f":"'Data Entry Sheet'!H20","v":0},null,null,null,null,null,null,null,null,"49-64",null,null,4,null,{"$f":"'Data Entry Sheet'!B20","v":0},{"$f":"'Data Entry Sheet'!C20","v":" "},{"$f":"'Data Entry Sheet'!D20","v":0},{"$f":"'Data Entry Sheet'!E20","v":0},{"$f":"'Data Entry Sheet'!F20","v":0},{"$f":"'Data Entry Sheet'!G20","v":""},{"$f":"'Data Entry Sheet'!H20","v":0},{"$f":"'Data Entry Sheet'!I20","v":0},{"$f":"'Data Entry Sheet'!J20","v":" "},{"$f":"'Data Entry Sheet'!K20","v":""},null,"0 0000","---"]
[null,"x",null,{"$f":"'Data Entry Sheet'!B21 & 'Data Entry Sheet'!C21 & 'Data Entry Sheet'!D21 & 'Data Entry Sheet'!E21 & 'Data Entry Sheet'!F21","v":" "},{"$f":"'Data Entry Sheet'!H21","v":0},null,null,null,null,null,null,null,null,null,null,null,5,null,{"$f":"'Data Entry Sheet'!B21","v":0},{"$f":"'Data Entry Sheet'!C21","v":" "},{"$f":"'Data Entry Sheet'!D21","v":0},{"$f":"'Data Entry Sheet'!E21","v":0},{"$f":"'Data Entry Sheet'!F21","v":0},{"$f":"'Data Entry Sheet'!G21","v":""},{"$f":"'Data Entry Sheet'!H21","v":0},{"$f":"'Data Entry Sheet'!I21","v":0},{"$f":"'Data Entry Sheet'!J21","v":" "},{"$f":"'Data Entry Sheet'!K21","v":""},null,"0 0000","---"]
[null,"x",null,{"$f":"'Data Entry Sheet'!B22 & 'Data Entry Sheet'!C22 & 'Data Entry Sheet'!D22 & 'Data Entry Sheet'!E22 & 'Data Entry Sheet'!F22","v":" "},{"$f":"'Data Entry Sheet'!H22","v":0},null,null,null,null,null,null,null,null,null,null,null,6,null,{"$f":"'Data Entry Sheet'!B22","v":0},{"$f":"'Data Entry Sheet'!C22","v":" "},{"$f":"'Data Entry Sheet'!D22","v":0},{"$f":"'Data Entry Sheet'!E22","v":0},{"$f":"'Data Entry Sheet'!F22","v":0},{"$f":"'Data Entry Sheet'!G22","v":""},{"$f":"'Data Entry Sheet'!H22","v":0},{"$f":"'Data Entry Sheet'!I22","v":0},{"$f":"'Data Entry Sheet'!J22","v":" "},{"$f":"'Data Entry Sheet'!K22","v":""},null,"0 0000","---"]
[null,"x",null,{"$f":"'Data Entry Sheet'!B23 & 'Data Entry Sheet'!C23 & 'Data Entry Sheet'!D23 & 'Data Entry Sheet'!E23 & 'Data Entry Sheet'!F23","v":" "},{"$f":"'Data Entry Sheet'!H23","v":0},null,null,null,null,null,null,null,null,null,null,null,7,null,{"$f":"'Data Entry Sheet'!B23","v":0},{"$f":"'Data Entry Sheet'!C23","v":" "},{"$f":"'Data Entry Sheet'!D23","v":0},{"$f":"'Data Entry Sheet'!E23","v":0},{"$f":"'Data Entry Sheet'!F23","v":0},{"$f":"'Data Entry Sheet'!G23","v":""},{"$f":"'Data Entry Sheet'!H23","v":0},{"$f":"'Data Entry Sheet'!I23","v":0},{"$f":"'Data Entry Sheet'!J23","v":" "},{"$f":"'Data Entry Sheet'!K23","v":""},null,"0 0000","---"]
[null,"x",null,{"$f":"'Data Entry Sheet'!B24 & 'Data Entry Sheet'!C24 & 'Data Entry Sheet'!D24 & 'Data Entry Sheet'!E24 & 'Data Entry Sheet'!F24","v":" "},{"$f":"'Data Entry Sheet'!H24","v":0},null,null,null,null,null,null,null,null,null,null,null,8,null,{"$f":"'Data Entry Sheet'!B24","v":0},{"$f":"'Data Entry Sheet'!C24","v":" "},{"$f":"'Data Entry Sheet'!D24","v":0},{"$f":"'Data Entry Sheet'!E24","v":0},{"$f":"'Data Entry Sheet'!F24","v":0},{"$f":"'Data Entry Sheet'!G24","v":""},{"$f":"'Data Entry Sheet'!H24","v":0},{"$f":"'Data Entry Sheet'!I24","v":0},{"$f":"'Data Entry Sheet'!J24","v":" "},{"$f":"'Data Entry Sheet'!K24","v":""},null,"0 0000","---"]
[null,"x",null,{"$f":"'Data Entry Sheet'!B25 & 'Data Entry Sheet'!C25 & 'Data Entry Sheet'!D25 & 'Data Entry Sheet'!E25 & 'Data Entry Sheet'!F25","v":" "},{"$f":"'Data Entry Sheet'!H25","v":0},null,null,null,null,null,null,null,null,null,null,null,9,null,{"$f":"'Data Entry Sheet'!B25","v":0},{"$f":"'Data Entry Sheet'!C25","v":" "},{"$f":"'Data Entry Sheet'!D25","v":0},{"$f":"'Data Entry Sheet'!E25","v":0},{"$f":"'Data Entry Sheet'!F25","v":0},{"$f":"'Data Entry Sheet'!G25","v":""},{"$f":"'Data Entry Sheet'!H25","v":0},{"$f":"'Data Entry Sheet'!I25","v":0},{"$f":"'Data Entry Sheet'!J25","v":" "},{"$f":"'Data Entry Sheet'!K25","v":""},null,"0 0000","---"]
[null,"x",null,{"$f":"'Data Entry Sheet'!B26 & 'Data Entry Sheet'!C26 & 'Data Entry Sheet'!D26 & 'Data Entry Sheet'!E26 & 'Data Entry Sheet'!F26","v":" "},{"$f":"'Data Entry Sheet'!H26","v":0},null,null,null,null,null,null,null,null,null,null,null,10,null,{"$f":"'Data Entry Sheet'!B26","v":0},{"$f":"'Data Entry Sheet'!C26","v":" "},{"$f":"'Data Entry Sheet'!D26","v":0},{"$f":"'Data Entry Sheet'!E26","v":0},{"$f":"'Data Entry Sheet'!F26","v":0},{"$f":"'Data Entry Sheet'!G26","v":""},{"$f":"'Data Entry Sheet'!H26","v":0},{"$f":"'Data Entry Sheet'!I26","v":0},{"$f":"'Data Entry Sheet'!J26","v":" "},{"$f":"'Data Entry Sheet'!K26","v":""},null,"0 0000","---"]
[null,"x",null,{"$f":"'Data Entry Sheet'!B27 & 'Data Entry Sheet'!C27 & 'Data Entry Sheet'!D27 & 'Data Entry Sheet'!E27 & 'Data Entry Sheet'!F27","v":" "},{"$f":"'Data Entry Sheet'!H27","v":0},null,null,null,null,null,null,null,null,null,null,null,11,null,{"$f":"'Data Entry Sheet'!B27","v":0},{"$f":"'Data Entry Sheet'!C27","v":" "},{"$f":"'Data Entry Sheet'!D27","v":0},{"$f":"'Data Entry Sheet'!E27","v":0},{"$f":"'Data Entry Sheet'!F27","v":0},{"$f":"'Data Entry Sheet'!G27","v":""},{"$f":"'Data Entry Sheet'!H27","v":0},{"$f":"'Data Entry Sheet'!I27","v":0},{"$f":"'Data Entry Sheet'!J27","v":" "},{"$f":"'Data Entry Sheet'!K27","v":""},null,"0 0000","---"]
[null,"x",null,{"$f":"'Data Entry Sheet'!B28 & 'Data Entry Sheet'!C28 & 'Data Entry Sheet'!D28 & 'Data Entry Sheet'!E28 & 'Data Entry Sheet'!F28","v":" "},{"$f":"'Data Entry Sheet'!H28","v":0},null,null,null,null,null,null,null,null,null,null,null,12,null,{"$f":"'Data Entry Sheet'!B28","v":0},{"$f":"'Data Entry Sheet'!C28","v":" "},{"$f":"'Data Entry Sheet'!D28","v":0},{"$f":"'Data Entry Sheet'!E28","v":0},{"$f":"'Data Entry Sheet'!F28","v":0},{"$f":"'Data Entry Sheet'!G28","v":""},{"$f":"'Data Entry Sheet'!H28","v":0},{"$f":"'Data Entry Sheet'!I28","v":0},{"$f":"'Data Entry Sheet'!J28","v":" "},{"$f":"'Data Entry Sheet'!K28","v":""},null,"0 0000","---"]
[null,"x",null,{"$f":"'Data Entry Sheet'!B29 & 'Data Entry Sheet'!C29 & 'Data Entry Sheet'!D29 & 'Data Entry Sheet'!E29 & 'Data Entry Sheet'!F29","v":" "},{"$f":"'Data Entry Sheet'!H29","v":0},null,null,null,null,null,null,null,null,null,null,null,13,null,{"$f":"'Data Entry Sheet'!B29","v":0},{"$f":"'Data Entry Sheet'!C29","v":" "},{"$f":"'Data Entry Sheet'!D29","v":0},{"$f":"'Data Entry Sheet'!E29","v":0},{"$f":"'Data Entry Sheet'!F29","v":0},{"$f":"'Data Entry Sheet'!G29","v":""},{"$f":"'Data Entry Sheet'!H29","v":0},{"$f":"'Data Entry Sheet'!I29","v":0},{"$f":"'Data Entry Sheet'!J29","v":" "},{"$f":"'Data Entry Sheet'!K29","v":""},null,"0 0000","---"]
[null,"x",null,{"$f":"'Data Entry Sheet'!B30 & 'Data Entry Sheet'!C30 & 'Data Entry Sheet'!D30 & 'Data Entry Sheet'!E30 & 'Data Entry Sheet'!F30","v":" "},{"$f":"'Data Entry Sheet'!H30","v":0},null,null,null,null,null,null,null,null,null,null,null,14,null,{"$f":"'Data Entry Sheet'!B30","v":0},{"$f":"'Data Entry Sheet'!C30","v":" "},{"$f":"'Data Entry Sheet'!D30","v":0},{"$f":"'Data Entry Sheet'!E30","v":0},{"$f":"'Data Entry Sheet'!F30","v":0},{"$f":"'Data Entry Sheet'!G30","v":""},{"$f":"'Data Entry Sheet'!H30","v":0},{"$f":"'Data Entry Sheet'!I30","v":0},{"$f":"'Data Entry Sheet'!J30","v":" "},{"$f":"'Data Entry Sheet'!K30","v":""},null,"0 0000","---"]
[null,"x",null,{"$f":"'Data Entry Sheet'!B31 & 'Data Entry Sheet'!C31 & 'Data Entry Sheet'!D31 & 'Data Entry Sheet'!E31 & 'Data Entry Sheet'!F31","v":" "},{"$f":"'Data Entry Sheet'!H31","v":0},null,null,null,null,null,null,null,null,null,null,null,15,null,{"$f":"'Data Entry Sheet'!B31","v":0},{"$f":"'Data Entry Sheet'!C31","v":" "},{"$f":"'Data Entry Sheet'!D31","v":0},{"$f":"'Data Entry Sheet'!E31","v":0},{"$f":"'Data Entry Sheet'!F31","v":0},{"$f":"'Data Entry Sheet'!G31","v":""},{"$f":"'Data Entry Sheet'!H31","v":0},{"$f":"'Data Entry Sheet'!I31","v":0},{"$f":"'Data Entry Sheet'!J31","v":" "},{"$f":"'Data Entry Sheet'!K31","v":""},null,"0 0000","---"]
[null,"x",null,{"$f":"'Data Entry Sheet'!B32 & 'Data Entry Sheet'!C32 & 'Data Entry Sheet'!D32 & 'Data Entry Sheet'!E32 & 'Data Entry Sheet'!F32","v":" "},{"$f":"'Data Entry Sheet'!H32","v":0},null,null,null,null,null,null,null,null,null,null,null,16,null,{"$f":"'Data Entry Sheet'!B32","v":0},{"$f":"'Data Entry Sheet'!C32","v":" "},{"$f":"'Data Entry Sheet'!D32","v":0},{"$f":"'Data Entry Sheet'!E32","v":0},{"$f":"'Data Entry Sheet'!F32","v":0},{"$f":"'Data Entry Sheet'!G32","v":""},{"$f":"'Data Entry Sheet'!H32","v":0},{"$f":"'Data Entry Sheet'!I32","v":0},{"$f":"'Data Entry Sheet'!J32","v":" "},{"$f":"'Data Entry Sheet'!K32","v":""},null,"0 0000","---"]
[null,"x",null,{"$f":"'Data Entry Sheet'!B33 & 'Data Entry Sheet'!C33 & 'Data Entry Sheet'!D33 & 'Data Entry Sheet'!E33 & 'Data Entry Sheet'!F33","v":" "},{"$f":"'Data Entry Sheet'!H33","v":0},null,null,null,null,null,null,null,null,null,null,null,17,null,{"$f":"'Data Entry Sheet'!B33","v":0},{"$f":"'Data Entry Sheet'!C33","v":" "},{"$f":"'Data Entry Sheet'!D33","v":0},{"$f":"'Data Entry Sheet'!E33","v":0},{"$f":"'Data Entry Sheet'!F33","v":0},{"$f":"'Data Entry Sheet'!G33","v":""},{"$f":"'Data Entry Sheet'!H33","v":0},{"$f":"'Data Entry Sheet'!I33","v":0},{"$f":"'Data Entry Sheet'!J33","v":" "},{"$f":"'Data Entry Sheet'!K33","v":""},null,"0 0000","---"]
[null,"x",null,{"$f":"'Data Entry Sheet'!B34 & 'Data Entry Sheet'!C34 & 'Data Entry Sheet'!D34 & 'Data Entry Sheet'!E34 & 'Data Entry Sheet'!F34","v":" "},{"$f":"'Data Entry Sheet'!H34","v":0},null,null,null,null,null,null,null,null,null,null,null,18,null,{"$f":"'Data Entry Sheet'!B34","v":0},{"$f":"'Data Entry Sheet'!C34","v":" "},{"$f":"'Data Entry Sheet'!D34","v":0},{"$f":"'Data Entry Sheet'!E34","v":0},{"$f":"'Data Entry Sheet'!F34","v":0},{"$f":"'Data Entry Sheet'!G34","v":""},{"$f":"'Data Entry Sheet'!H34","v":0},{"$f":"'Data Entry Sheet'!I34","v":0},{"$f":"'Data Entry Sheet'!J34","v":" "},{"$f":"'Data Entry Sheet'!K34","v":""},null,"0 0000","---"]
[null,"x",null,{"$f":"'Data Entry Sheet'!B35 & 'Data Entry Sheet'!C35 & 'Data Entry Sheet'!D35 & 'Data Entry Sheet'!E35 & 'Data Entry Sheet'!F35","v":" "},{"$f":"'Data Entry Sheet'!H35","v":0},null,null,null,null,null,null,null,null,null,null,null,19,null,{"$f":"'Data Entry Sheet'!B35","v":0},{"$f":"'Data Entry Sheet'!C35","v":" "},{"$f":"'Data Entry Sheet'!D35","v":0},{"$f":"'Data Entry Sheet'!E35","v":0},{"$f":"'Data Entry Sheet'!F35","v":0},{"$f":"'Data Entry Sheet'!G35","v":""},{"$f":"'Data Entry Sheet'!H35","v":0},{"$f":"'Data Entry Sheet'!I35","v":0},{"$f":"'Data Entry Sheet'!J35","v":" "},{"$f":"'Data Entry Sheet'!K35","v":""},null,"0 0000","---"]
[null,"x",null,{"$f":"'Data Entry Sheet'!B36 & 'Data Entry Sheet'!C36 & 'Data Entry Sheet'!D36 & 'Data Entry Sheet'!E36 & 'Data Entry Sheet'!F36","v":" "},{"$f":"'Data Entry Sheet'!H36","v":0},null,null,null,null,null,null,null,null,null,null,null,20,null,{"$f":"'Data Entry Sheet'!B36","v":0},{"$f":"'Data Entry Sheet'!C36","v":" "},{"$f":"'Data Entry Sheet'!D36","v":0},{"$f":"'Data Entry Sheet'!E36","v":0},{"$f":"'Data Entry Sheet'!F36","v":0},{"$f":"'Data Entry Sheet'!G36","v":""},{"$f":"'Data Entry Sheet'!H36","v":0},{"$f":"'Data Entry Sheet'!I36","v":0},{"$f":"'Data Entry Sheet'!J36","v":" "},{"$f":"'Data Entry Sheet'!K36","v":""},null,"0 0000","---"]
[null,"x",null,{"$f":"'Data Entry Sheet'!B37 & 'Data Entry Sheet'!C37 & 'Data Entry Sheet'!D37 & 'Data Entry Sheet'!E37 & 'Data Entry Sheet'!F37","v":" "},{"$f":"'Data Entry Sheet'!H37","v":0},null,null,null,null,null,null,null,null,null,null,null,21,null,{"$f":"'Data Entry Sheet'!B37","v":0},{"$f":"'Data Entry Sheet'!C37","v":" "},{"$f":"'Data Entry Sheet'!D37","v":0},{"$f":"'Data Entry Sheet'!E37","v":0},{"$f":"'Data Entry Sheet'!F37","v":0},{"$f":"'Data Entry Sheet'!G37","v":""},{"$f":"'Data Entry Sheet'!H37","v":0},{"$f":"'Data Entry Sheet'!I37","v":0},{"$f":"'Data Entry Sheet'!J37","v":" "},{"$f":"'Data Entry Sheet'!K37","v":""},null,"0 0000","---"]
[null,"x",null,{"$f":"'Data Entry Sheet'!B38 & 'Data Entry Sheet'!C38 & 'Data Entry Sheet'!D38 & 'Data Entry Sheet'!E38 & 'Data Entry Sheet'!F38","v":" "},{"$f":"'Data Entry Sheet'!H38","v":0},null,null,null,null,null,null,null,null,null,null,null,22,null,{"$f":"'Data Entry Sheet'!B38","v":0},{"$f":"'Data Entry Sheet'!C38","v":" "},{"$f":"'Data Entry Sheet'!D38","v":0},{"$f":"'Data Entry Sheet'!E38","v":0},{"$f":"'Data Entry Sheet'!F38","v":0},{"$f":"'Data Entry Sheet'!G38","v":""},{"$f":"'Data Entry Sheet'!H38","v":0},{"$f":"'Data Entry Sheet'!I38","v":0},{"$f":"'Data Entry Sheet'!J38","v":" "},{"$f":"'Data Entry Sheet'!K38","v":""},null,"0 0000","---"]
[null,"x",null,{"$f":"'Data Entry Sheet'!B39 & 'Data Entry Sheet'!C39 & 'Data Entry Sheet'!D39 & 'Data Entry Sheet'!E39 & 'Data Entry Sheet'!F39","v":" "},{"$f":"'Data Entry Sheet'!H39","v":0},null,null,null,null,null,null,null,null,null,null,null,23,null,{"$f":"'Data Entry Sheet'!B39","v":0},{"$f":"'Data Entry Sheet'!C39","v":" "},{"$f":"'Data Entry Sheet'!D39","v":0},{"$f":"'Data Entry Sheet'!E39","v":0},{"$f":"'Data Entry Sheet'!F39","v":0},{"$f":"'Data Entry Sheet'!G39","v":""},{"$f":"'Data Entry Sheet'!H39","v":0},{"$f":"'Data Entry Sheet'!I39","v":0},{"$f":"'Data Entry Sheet'!J39","v":" "},{"$f":"'Data Entry Sheet'!K39","v":""},null,"0 0000","---"]
[null,"x",null,{"$f":"'Data Entry Sheet'!B40 & 'Data Entry Sheet'!C40 & 'Data Entry Sheet'!D40 & 'Data Entry Sheet'!E40 & 'Data Entry Sheet'!F40","v":" "},{"$f":"'Data Entry Sheet'!H40","v":0},null,null,null,null,null,null,null,null,null,null,null,24,null,{"$f":"'Data Entry Sheet'!B40","v":0},{"$f":"'Data Entry Sheet'!C40","v":" "},{"$f":"'Data Entry Sheet'!D40","v":0},{"$f":"'Data Entry Sheet'!E40","v":0},{"$f":"'Data Entry Sheet'!F40","v":0},{"$f":"'Data Entry Sheet'!G40","v":""},{"$f":"'Data Entry Sheet'!H40","v":0},{"$f":"'Data Entry Sheet'!I40","v":0},{"$f":"'Data Entry Sheet'!J40","v":" "},{"$f":"'Data Entry Sheet'!K40","v":""},null,"0 0000","---"]
[null,"x",null,{"$f":"'Data Entry Sheet'!B41 & 'Data Entry Sheet'!C41 & 'Data Entry Sheet'!D41 & 'Data Entry Sheet'!E41 & 'Data Entry Sheet'!F41","v":" "},{"$f":"'Data Entry Sheet'!H41","v":0},null,null,null,null,null,null,null,null,null,null,null,25,null,{"$f":"'Data Entry Sheet'!B41","v":0},{"$f":"'Data Entry Sheet'!C41","v":" "},{"$f":"'Data Entry Sheet'!D41","v":0},{"$f":"'Data Entry Sheet'!E41","v":0},{"$f":"'Data Entry Sheet'!F41","v":0},{"$f":"'Data Entry Sheet'!G41","v":""},{"$f":"'Data Entry Sheet'!H41","v":0},{"$f":"'Data Entry Sheet'!I41","v":0},{"$f":"'Data Entry Sheet'!J41","v":" "},{"$f":"'Data Entry Sheet'!K41","v":""},null,"0 0000","---"]
[null,"x",null,{"$f":"'Data Entry Sheet'!B42 & 'Data Entry Sheet'!C42 & 'Data Entry Sheet'!D42 & 'Data Entry Sheet'!E42 & 'Data Entry Sheet'!F42","v":" "},{"$f":"'Data Entry Sheet'!H42","v":0},null,null,null,null,null,null,null,null,null,null,null,26,null,{"$f":"'Data Entry Sheet'!B42","v":0},{"$f":"'Data Entry Sheet'!C42","v":" "},{"$f":"'Data Entry Sheet'!D42","v":0},{"$f":"'Data Entry Sheet'!E42","v":0},{"$f":"'Data Entry Sheet'!F42","v":0},{"$f":"'Data Entry Sheet'!G42","v":""},{"$f":"'Data Entry Sheet'!H42","v":0},{"$f":"'Data Entry Sheet'!I42","v":0},{"$f":"'Data Entry Sheet'!J42","v":" "},{"$f":"'Data Entry Sheet'!K42","v":""},null,"0 0000","---"]
[null,"x",null,{"$f":"'Data Entry Sheet'!B43 & 'Data Entry Sheet'!C43 & 'Data Entry Sheet'!D43 & 'Data Entry Sheet'!E43 & 'Data Entry Sheet'!F43","v":" "},{"$f":"'Data Entry Sheet'!H43","v":0},null,null,null,null,null,null,null,null,null,null,null,27,null,{"$f":"'Data Entry Sheet'!B43","v":0},{"$f":"'Data Entry Sheet'!C43","v":" "},{"$f":"'Data Entry Sheet'!D43","v":0},{"$f":"'Data Entry Sheet'!E43","v":0},{"$f":"'Data Entry Sheet'!F43","v":0},{"$f":"'Data Entry Sheet'!G43","v":""},{"$f":"'Data Entry Sheet'!H43","v":0},{"$f":"'Data Entry Sheet'!I43","v":0},{"$f":"'Data Entry Sheet'!J43","v":" "},{"$f":"'Data Entry Sheet'!K43","v":""},null,"0 0000","---"]
[null,"x",null,{"$f":"'Data Entry Sheet'!B44 & 'Data Entry Sheet'!C44 & 'Data Entry Sheet'!D44 & 'Data Entry Sheet'!E44 & 'Data Entry Sheet'!F44","v":" "},{"$f":"'Data Entry Sheet'!H44","v":0},null,null,null,null,null,null,null,null,null,null,null,28,null,{"$f":"'Data Entry Sheet'!B44","v":0},{"$f":"'Data Entry Sheet'!C44","v":" "},{"$f":"'Data Entry Sheet'!D44","v":0},{"$f":"'Data Entry Sheet'!E44","v":0},{"$f":"'Data Entry Sheet'!F44","v":0},{"$f":"'Data Entry Sheet'!G44","v":""},{"$f":"'Data Entry Sheet'!H44","v":0},{"$f":"'Data Entry Sheet'!I44","v":0},{"$f":"'Data Entry Sheet'!J44","v":" "},{"$f":"'Data Entry Sheet'!K44","v":""},null,"0 0000","---"]
[null,"x",null,{"$f":"'Data Entry Sheet'!B45 & 'Data Entry Sheet'!C45 & 'Data Entry Sheet'!D45 & 'Data Entry Sheet'!E45 & 'Data Entry Sheet'!F45","v":" "},{"$f":"'Data Entry Sheet'!H45","v":0},null,null,null,null,null,null,null,null,null,null,null,29,null,{"$f":"'Data Entry Sheet'!B45","v":0},{"$f":"'Data Entry Sheet'!C45","v":" "},{"$f":"'Data Entry Sheet'!D45","v":0},{"$f":"'Data Entry Sheet'!E45","v":0},{"$f":"'Data Entry Sheet'!F45","v":0},{"$f":"'Data Entry Sheet'!G45","v":""},{"$f":"'Data Entry Sheet'!H45","v":0},{"$f":"'Data Entry Sheet'!I45","v":0},{"$f":"'Data Entry Sheet'!J45","v":" "},{"$f":"'Data Entry Sheet'!K45","v":""},null,"0 0000","---"]
[null,"x",null,{"$f":"'Data Entry Sheet'!B46 & 'Data Entry Sheet'!C46 & 'Data Entry Sheet'!D46 & 'Data Entry Sheet'!E46 & 'Data Entry Sheet'!F46","v":" "},{"$f":"'Data Entry Sheet'!H46","v":0},null,null,null,null,null,null,null,null,null,null,null,30,null,{"$f":"'Data Entry Sheet'!B46","v":0},{"$f":"'Data Entry Sheet'!C46","v":" "},{"$f":"'Data Entry Sheet'!D46","v":0},{"$f":"'Data Entry Sheet'!E46","v":0},{"$f":"'Data Entry Sheet'!F46","v":0},{"$f":"'Data Entry Sheet'!G46","v":""},{"$f":"'Data Entry Sheet'!H46","v":0},{"$f":"'Data Entry Sheet'!I46","v":0},{"$f":"'Data Entry Sheet'!J46","v":" "},{"$f":"'Data Entry Sheet'!K46","v":""},null,"0 0000","---"]
[null,"x",null,{"$f":"'Data Entry Sheet'!B47 & 'Data Entry Sheet'!C47 & 'Data Entry Sheet'!D47 & 'Data Entry Sheet'!E47 & 'Data Entry Sheet'!F47","v":" "},{"$f":"'Data Entry Sheet'!H47","v":0},null,null,null,null,null,null,null,null,null,null,null,31,null,{"$f":"'Data Entry Sheet'!B47","v":0},{"$f":"'Data Entry Sheet'!C47","v":" "},{"$f":"'Data Entry Sheet'!D47","v":0},{"$f":"'Data Entry Sheet'!E47","v":0},{"$f":"'Data Entry Sheet'!F47","v":0},{"$f":"'Data Entry Sheet'!G47","v":""},{"$f":"'Data Entry Sheet'!H47","v":0},{"$f":"'Data Entry Sheet'!I47","v":0},{"$f":"'Data Entry Sheet'!J47","v":" "},{"$f":"'Data Entry Sheet'!K47","v":""},null,"0 0000","---"]
[null,"x",null,{"$f":"'Data Entry Sheet'!B48 & 'Data Entry Sheet'!C48 & 'Data Entry Sheet'!D48 & 'Data Entry Sheet'!E48 & 'Data Entry Sheet'!F48","v":" "},{"$f":"'Data Entry Sheet'!H48","v":0},null,null,null,null,null,null,null,null,null,null,null,32,null,{"$f":"'Data Entry Sheet'!B48","v":0},{"$f":"'Data Entry Sheet'!C48","v":" "},{"$f":"'Data Entry Sheet'!D48","v":0},{"$f":"'Data Entry Sheet'!E48","v":0},{"$f":"'Data Entry Sheet'!F48","v":0},{"$f":"'Data Entry Sheet'!G48","v":""},{"$f":"'Data Entry Sheet'!H48","v":0},{"$f":"'Data Entry Sheet'!I48","v":0},{"$f":"'Data Entry Sheet'!J48","v":" "},{"$f":"'Data Entry Sheet'!K48","v":""},null,"0 0000","---"]
[null,"x",null,{"$f":"'Data Entry Sheet'!B49 & 'Data Entry Sheet'!C49 & 'Data Entry Sheet'!D49 & 'Data Entry Sheet'!E49 & 'Data Entry Sheet'!F49","v":" "},{"$f":"'Data Entry Sheet'!H49","v":0},null,null,null,null,null,null,null,null,null,null,null,33,null,{"$f":"'Data Entry Sheet'!B49","v":0},{"$f":"'Data Entry Sheet'!C49","v":" "},{"$f":"'Data Entry Sheet'!D49","v":0},{"$f":"'Data Entry Sheet'!E49","v":0},{"$f":"'Data Entry Sheet'!F49","v":0},{"$f":"'Data Entry Sheet'!G49","v":""},{"$f":"'Data Entry Sheet'!H49","v":0},{"$f":"'Data Entry Sheet'!I49","v":0},{"$f":"'Data Entry Sheet'!J49","v":" "},{"$f":"'Data Entry Sheet'!K49","v":""},null,"0 0000","---"]
[null,"x",null,{"$f":"'Data Entry Sheet'!B50 & 'Data Entry Sheet'!C50 & 'Data Entry Sheet'!D50 & 'Data Entry Sheet'!E50 & 'Data Entry Sheet'!F50","v":" "},{"$f":"'Data Entry Sheet'!H50","v":0},null,null,null,null,null,null,null,null,null,null,null,34,null,{"$f":"'Data Entry Sheet'!B50","v":0},{"$f":"'Data Entry Sheet'!C50","v":" "},{"$f":"'Data Entry Sheet'!D50","v":0},{"$f":"'Data Entry Sheet'!E50","v":0},{"$f":"'Data Entry Sheet'!F50","v":0},{"$f":"'Data Entry Sheet'!G50","v":""},{"$f":"'Data Entry Sheet'!H50","v":0},{"$f":"'Data Entry Sheet'!I50","v":0},{"$f":"'Data Entry Sheet'!J50","v":" "},{"$f":"'Data Entry Sheet'!K50","v":""},null,"0 0000","---"]
[null,"x",null,{"$f":"'Data Entry Sheet'!B51 & 'Data Entry Sheet'!C51 & 'Data Entry Sheet'!D51 & 'Data Entry Sheet'!E51 & 'Data Entry Sheet'!F51","v":" "},{"$f":"'Data Entry Sheet'!H51","v":0},null,null,null,null,null,null,null,null,null,null,null,35,null,{"$f":"'Data Entry Sheet'!B51","v":0},{"$f":"'Data Entry Sheet'!C51","v":" "},{"$f":"'Data Entry Sheet'!D51","v":0},{"$f":"'Data Entry Sheet'!E51","v":0},{"$f":"'Data Entry Sheet'!F51","v":0},{"$f":"'Data Entry Sheet'!G51","v":""},{"$f":"'Data Entry Sheet'!H51","v":0},{"$f":"'Data Entry Sheet'!I51","v":0},{"$f":"'Data Entry Sheet'!J51","v":" "},{"$f":"'Data Entry Sheet'!K51","v":""},null,"0 0000","---"]
[null,"x",null,{"$f":"'Data Entry Sheet'!B52 & 'Data Entry Sheet'!C52 & 'Data Entry Sheet'!D52 & 'Data Entry Sheet'!E52 & 'Data Entry Sheet'!F52","v":" "},{"$f":"'Data Entry Sheet'!H52","v":0},null,null,null,null,null,null,null,null,null,null,null,36,null,{"$f":"'Data Entry Sheet'!B52","v":0},{"$f":"'Data Entry Sheet'!C52","v":" "},{"$f":"'Data Entry Sheet'!D52","v":0},{"$f":"'Data Entry Sheet'!E52","v":0},{"$f":"'Data Entry Sheet'!F52","v":0},{"$f":"'Data Entry Sheet'!G52","v":""},{"$f":"'Data Entry Sheet'!H52","v":0},{"$f":"'Data Entry Sheet'!I52","v":0},{"$f":"'Data Entry Sheet'!J52","v":" "},{"$f":"'Data Entry Sheet'!K52","v":""},null,"0 0000","---"]
[null,"x",null,{"$f":"'Data Entry Sheet'!B53 & 'Data Entry Sheet'!C53 & 'Data Entry Sheet'!D53 & 'Data Entry Sheet'!E53 & 'Data Entry Sheet'!F53","v":" "},{"$f":"'Data Entry Sheet'!H53","v":0},null,null,null,null,null,null,null,null,null,null,null,37,null,{"$f":"'Data Entry Sheet'!B53","v":0},{"$f":"'Data Entry Sheet'!C53","v":" "},{"$f":"'Data Entry Sheet'!D53","v":0},{"$f":"'Data Entry Sheet'!E53","v":0},{"$f":"'Data Entry Sheet'!F53","v":0},{"$f":"'Data Entry Sheet'!G53","v":""},{"$f":"'Data Entry Sheet'!H53","v":0},{"$f":"'Data Entry Sheet'!I53","v":0},{"$f":"'Data Entry Sheet'!J53","v":" "},{"$f":"'Data Entry Sheet'!K53","v":""},null,"0 0000","---"]
[null,"x",null,{"$f":"'Data Entry Sheet'!B54 & 'Data Entry Sheet'!C54 & 'Data Entry Sheet'!D54 & 'Data Entry Sheet'!E54 & 'Data Entry Sheet'!F54","v":" "},{"$f":"'Data Entry Sheet'!H54","v":0},null,null,null,null,null,null,null,null,null,null,null,38,null,{"$f":"'Data Entry Sheet'!B54","v":0},{"$f":"'Data Entry Sheet'!C54","v":" "},{"$f":"'Data Entry Sheet'!D54","v":0},{"$f":"'Data Entry Sheet'!E54","v":0},{"$f":"'Data Entry Sheet'!F54","v":0},{"$f":"'Data Entry Sheet'!G54","v":""},{"$f":"'Data Entry Sheet'!H54","v":0},{"$f":"'Data Entry Sheet'!I54","v":0},{"$f":"'Data Entry Sheet'!J54","v":" "},{"$f":"'Data Entry Sheet'!K54","v":""},null,"0 0000","---"]
[null,"x",null,{"$f":"'Data Entry Sheet'!B55 & 'Data Entry Sheet'!C55 & 'Data Entry Sheet'!D55 & 'Data Entry Sheet'!E55 & 'Data Entry Sheet'!F55","v":" "},{"$f":"'Data Entry Sheet'!H55","v":0},null,null,null,null,null,null,null,null,null,null,null,39,null,{"$f":"'Data Entry Sheet'!B55","v":0},{"$f":"'Data Entry Sheet'!C55","v":" "},{"$f":"'Data Entry Sheet'!D55","v":0},{"$f":"'Data Entry Sheet'!E55","v":0},{"$f":"'Data Entry Sheet'!F55","v":0},{"$f":"'Data Entry Sheet'!G55","v":""},{"$f":"'Data Entry Sheet'!H55","v":0},{"$f":"'Data Entry Sheet'!I55","v":0},{"$f":"'Data Entry Sheet'!J55","v":" "},{"$f":"'Data Entry Sheet'!K55","v":""},null,"0 0000","---"]
[null,"x",null,{"$f":"'Data Entry Sheet'!B56 & 'Data Entry Sheet'!C56 & 'Data Entry Sheet'!D56 & 'Data Entry Sheet'!E56 & 'Data Entry Sheet'!F56","v":" "},{"$f":"'Data Entry Sheet'!H56","v":0},null,null,null,null,null,null,null,null,null,null,null,40,null,{"$f":"'Data Entry Sheet'!B56","v":0},{"$f":"'Data Entry Sheet'!C56","v":" "},{"$f":"'Data Entry Sheet'!D56","v":0},{"$f":"'Data Entry Sheet'!E56","v":0},{"$f":"'Data Entry Sheet'!F56","v":0},{"$f":"'Data Entry Sheet'!G56","v":""},{"$f":"'Data Entry Sheet'!H56","v":0},{"$f":"'Data Entry Sheet'!I56","v":0},{"$f":"'Data Entry Sheet'!J56","v":" "},{"$f":"'Data Entry Sheet'!K56","v":""},null,"0 0000","---"]
[null,"",null,{"$f":"'Data Entry Sheet'!B57 & 'Data Entry Sheet'!C57 & 'Data Entry Sheet'!D57 & 'Data Entry Sheet'!E57 & 'Data Entry Sheet'!F57","v":" "},{"$f":"'Data Entry Sheet'!H57","v":0},null,null,null,null,null,null,null,null,null,null,null,41,null,{"$f":"'Data Entry Sheet'!B57","v":0},{"$f":"'Data Entry Sheet'!C57","v":" "},{"$f":"'Data Entry Sheet'!D57","v":0},{"$f":"'Data Entry Sheet'!E57","v":0},{"$f":"'Data Entry Sheet'!F57","v":0},{"$f":"'Data Entry Sheet'!G57","v":""},{"$f":"'Data Entry Sheet'!H57","v":0},{"$f":"'Data Entry Sheet'!I57","v":0},{"$f":"'Data Entry Sheet'!J57","v":" "},{"$f":"'Data Entry Sheet'!K57","v":""},null,"0 0000","---"]
[null,"",null,{"$f":"'Data Entry Sheet'!B58 & 'Data Entry Sheet'!C58 & 'Data Entry Sheet'!D58 & 'Data Entry Sheet'!E58 & 'Data Entry Sheet'!F58","v":" "},{"$f":"'Data Entry Sheet'!H58","v":0},null,null,null,null,null,null,null,null,null,null,null,42,null,{"$f":"'Data Entry Sheet'!B58","v":0},{"$f":"'Data Entry Sheet'!C58","v":" "},{"$f":"'Data Entry Sheet'!D58","v":0},{"$f":"'Data Entry Sheet'!E58","v":0},{"$f":"'Data Entry Sheet'!F58","v":0},{"$f":"'Data Entry Sheet'!G58","v":""},{"$f":"'Data Entry Sheet'!H58","v":0},{"$f":"'Data Entry Sheet'!I58","v":0},{"$f":"'Data Entry Sheet'!J58","v":" "},{"$f":"'Data Entry Sheet'!K58","v":""},null,"0 0000","---"]
[null,"",null,{"$f":"'Data Entry Sheet'!B59 & 'Data Entry Sheet'!C59 & 'Data Entry Sheet'!D59 & 'Data Entry Sheet'!E59 & 'Data Entry Sheet'!F59","v":" "},{"$f":"'Data Entry Sheet'!H59","v":0},null,null,null,null,null,null,null,null,null,null,null,43,null,{"$f":"'Data Entry Sheet'!B59","v":0},{"$f":"'Data Entry Sheet'!C59","v":" "},{"$f":"'Data Entry Sheet'!D59","v":0},{"$f":"'Data Entry Sheet'!E59","v":0},{"$f":"'Data Entry Sheet'!F59","v":0},{"$f":"'Data Entry Sheet'!G59","v":""},{"$f":"'Data Entry Sheet'!H59","v":0},{"$f":"'Data Entry Sheet'!I59","v":0},{"$f":"'Data Entry Sheet'!J59","v":" "},{"$f":"'Data Entry Sheet'!K59","v":""},null,"0 0000","---"]
[null,"",null,{"$f":"'Data Entry Sheet'!B60 & 'Data Entry Sheet'!C60 & 'Data Entry Sheet'!D60 & 'Data Entry Sheet'!E60 & 'Data Entry Sheet'!F60","v":" "},{"$f":"'Data Entry Sheet'!H60","v":0},null,null,null,null,null,null,null,null,null,null,null,44,null,{"$f":"'Data Entry Sheet'!B60","v":0},{"$f":"'Data Entry Sheet'!C60","v":" "},{"$f":"'Data Entry Sheet'!D60","v":0},{"$f":"'Data Entry Sheet'!E60","v":0},{"$f":"'Data Entry Sheet'!F60","v":0},{"$f":"'Data Entry Sheet'!G60","v":""},{"$f":"'Data Entry Sheet'!H60","v":0},{"$f":"'Data Entry Sheet'!I60","v":0},{"$f":"'Data Entry Sheet'!J60","v":" "},{"$f":"'Data Entry Sheet'!K60","v":""},null,"0 0000","---"]
[null,"",null,{"$f":"'Data Entry Sheet'!B61 & 'Data Entry Sheet'!C61 & 'Data Entry Sheet'!D61 & 'Data Entry Sheet'!E61 & 'Data Entry Sheet'!F61","v":" "},{"$f":"'Data Entry Sheet'!H61","v":0},null,null,null,null,null,null,null,null,null,null,null,45,null,{"$f":"'Data Entry Sheet'!B61","v":0},{"$f":"'Data Entry Sheet'!C61","v":" "},{"$f":"'Data Entry Sheet'!D61","v":0},{"$f":"'Data Entry Sheet'!E61","v":0},{"$f":"'Data Entry Sheet'!F61","v":0},{"$f":"'Data Entry Sheet'!G61","v":""},{"$f":"'Data Entry Sheet'!H61","v":0},{"$f":"'Data Entry Sheet'!I61","v":0},{"$f":"'Data Entry Sheet'!J61","v":" "},{"$f":"'Data Entry Sheet'!K61","v":""},null,"0 0000","---"]
[null,"",null,{"$f":"'Data Entry Sheet'!B62 & 'Data Entry Sheet'!C62 & 'Data Entry Sheet'!D62 & 'Data Entry Sheet'!E62 & 'Data Entry Sheet'!F62","v":" "},{"$f":"'Data Entry Sheet'!H62","v":0},null,null,null,null,null,null,null,null,null,null,null,46,null,{"$f":"'Data Entry Sheet'!B62","v":0},{"$f":"'Data Entry Sheet'!C62","v":" "},{"$f":"'Data Entry Sheet'!D62","v":0},{"$f":"'Data Entry Sheet'!E62","v":0},{"$f":"'Data Entry Sheet'!F62","v":0},{"$f":"'Data Entry Sheet'!G62","v":""},{"$f":"'Data Entry Sheet'!H62","v":0},{"$f":"'Data Entry Sheet'!I62","v":0},{"$f":"'Data Entry Sheet'!J62","v":" "},{"$f":"'Data Entry Sheet'!K62","v":""},null,"0 0000","---"]
[null,"",null,{"$f":"'Data Entry Sheet'!B63 & 'Data Entry Sheet'!C63 & 'Data Entry Sheet'!D63 & 'Data Entry Sheet'!E63 & 'Data Entry Sheet'!F63","v":" "},{"$f":"'Data Entry Sheet'!H63","v":0},null,null,null,null,null,null,null,null,null,null,null,47,null,{"$f":"'Data Entry Sheet'!B63","v":0},{"$f":"'Data Entry Sheet'!C63","v":" "},{"$f":"'Data Entry Sheet'!D63","v":0},{"$f":"'Data Entry Sheet'!E63","v":0},{"$f":"'Data Entry Sheet'!F63","v":0},{"$f":"'Data Entry Sheet'!G63","v":""},{"$f":"'Data Entry Sheet'!H63","v":0},{"$f":"'Data Entry Sheet'!I63","v":0},{"$f":"'Data Entry Sheet'!J63","v":" "},{"$f":"'Data Entry Sheet'!K63","v":""},null,"0 0000","---"]
[null,"",null,{"$f":"'Data Entry Sheet'!B64 & 'Data Entry Sheet'!C64 & 'Data Entry Sheet'!D64 & 'Data Entry Sheet'!E64 & 'Data Entry Sheet'!F64","v":" "},{"$f":"'Data Entry Sheet'!H64","v":0},null,null,null,null,null,null,null,null,null,null,null,48,null,{"$f":"'Data Entry Sheet'!B64","v":0},{"$f":"'Data Entry Sheet'!C64","v":" "},{"$f":"'Data Entry Sheet'!D64","v":0},{"$f":"'Data Entry Sheet'!E64","v":0},{"$f":"'Data Entry Sheet'!F64","v":0},{"$f":"'Data Entry Sheet'!G64","v":""},{"$f":"'Data Entry Sheet'!H64","v":0},{"$f":"'Data Entry Sheet'!I64","v":0},{"$f":"'Data Entry Sheet'!J64","v":" "},{"$f":"'Data Entry Sheet'!K64","v":""},null,"0 0000","---"]
[null,"",null,{"$f":"'Data Entry Sheet'!B65 & 'Data Entry Sheet'!C65 & 'Data Entry Sheet'!D65 & 'Data Entry Sheet'!E65 & 'Data Entry Sheet'!F65","v":" "},{"$f":"'Data Entry Sheet'!H65","v":0},null,null,null,null,null,null,null,null,null,null,null,49,null,{"$f":"'Data Entry Sheet'!B65","v":0},{"$f":"'Data Entry Sheet'!C65","v":" "},{"$f":"'Data Entry Sheet'!D65","v":0},{"$f":"'Data Entry Sheet'!E65","v":0},{"$f":"'Data Entry Sheet'!F65","v":0},{"$f":"'Data Entry Sheet'!G65","v":""},{"$f":"'Data Entry Sheet'!H65","v":0},{"$f":"'Data Entry Sheet'!I65","v":0},{"$f":"'Data Entry Sheet'!J65","v":" "},{"$f":"'Data Entry Sheet'!K65","v":""},null,"0 0000","---"]
[null,"",null,{"$f":"'Data Entry Sheet'!B66 & 'Data Entry Sheet'!C66 & 'Data Entry Sheet'!D66 & 'Data Entry Sheet'!E66 & 'Data Entry Sheet'!F66","v":" "},{"$f":"'Data Entry Sheet'!H66","v":0},null,null,null,null,null,null,null,null,null,null,null,50,null,{"$f":"'Data Entry Sheet'!B66","v":0},{"$f":"'Data Entry Sheet'!C66","v":" "},{"$f":"'Data Entry Sheet'!D66","v":0},{"$f":"'Data Entry Sheet'!E66","v":0},{"$f":"'Data Entry Sheet'!F66","v":0},{"$f":"'Data Entry Sheet'!G66","v":""},{"$f":"'Data Entry Sheet'!H66","v":0},{"$f":"'Data Entry Sheet'!I66","v":0},{"$f":"'Data Entry Sheet'!J66","v":" "},{"$f":"'Data Entry Sheet'!K66","v":""},null,"0 0000","---"]
[null,"",null,{"$f":"'Data Entry Sheet'!B67 & 'Data Entry Sheet'!C67 & 'Data Entry Sheet'!D67 & 'Data Entry Sheet'!E67 & 'Data Entry Sheet'!F67","v":" "},{"$f":"'Data Entry Sheet'!H67","v":0},null,null,null,null,null,null,null,null,null,null,null,51,null,{"$f":"'Data Entry Sheet'!B67","v":0},{"$f":"'Data Entry Sheet'!C67","v":" "},{"$f":"'Data Entry Sheet'!D67","v":0},{"$f":"'Data Entry Sheet'!E67","v":0},{"$f":"'Data Entry Sheet'!F67","v":0},{"$f":"'Data Entry Sheet'!G67","v":""},{"$f":"'Data Entry Sheet'!H67","v":0},{"$f":"'Data Entry Sheet'!I67","v":0},{"$f":"'Data Entry Sheet'!J67","v":" "},{"$f":"'Data Entry Sheet'!K67","v":""},null,"0 0000","---"]
[null,"",null,{"$f":"'Data Entry Sheet'!B68 & 'Data Entry Sheet'!C68 & 'Data Entry Sheet'!D68 & 'Data Entry Sheet'!E68 & 'Data Entry Sheet'!F68","v":" "},{"$f":"'Data Entry Sheet'!H68","v":0},null,null,null,null,null,null,null,null,null,null,null,52,null,{"$f":"'Data Entry Sheet'!B68","v":0},{"$f":"'Data Entry Sheet'!C68","v":" "},{"$f":"'Data Entry Sheet'!D68","v":0},{"$f":"'Data Entry Sheet'!E68","v":0},{"$f":"'Data Entry Sheet'!F68","v":0},{"$f":"'Data Entry Sheet'!G68","v":""},{"$f":"'Data Entry Sheet'!H68","v":0},{"$f":"'Data Entry Sheet'!I68","v":0},{"$f":"'Data Entry Sheet'!J68","v":" "},{"$f":"'Data Entry Sheet'!K68","v":""},null,"0 0000","---"]
[null,"",null,{"$f":"'Data Entry Sheet'!B69 & 'Data Entry Sheet'!C69 & 'Data Entry Sheet'!D69 & 'Data Entry Sheet'!E69 & 'Data Entry Sheet'!F69","v":" "},{"$f":"'Data Entry Sheet'!H69","v":0},null,null,null,null,null,null,null,null,null,null,null,53,null,{"$f":"'Data Entry Sheet'!B69","v":0},{"$f":"'Data Entry Sheet'!C69","v":" "},{"$f":"'Data Entry Sheet'!D69","v":0},{"$f":"'Data Entry Sheet'!E69","v":0},{"$f":"'Data Entry Sheet'!F69","v":0},{"$f":"'Data Entry Sheet'!G69","v":""},{"$f":"'Data Entry Sheet'!H69","v":0},{"$f":"'Data Entry Sheet'!I69","v":0},{"$f":"'Data Entry Sheet'!J69","v":" "},{"$f":"'Data Entry Sheet'!K69","v":""},null,"0 0000","---"]
[null,"",null,{"$f":"'Data Entry Sheet'!B70 & 'Data Entry Sheet'!C70 & 'Data Entry Sheet'!D70 & 'Data Entry Sheet'!E70 & 'Data Entry Sheet'!F70","v":" "},{"$f":"'Data Entry Sheet'!H70","v":0},null,null,null,null,null,null,null,null,null,null,null,54,null,{"$f":"'Data Entry Sheet'!B70","v":0},{"$f":"'Data Entry Sheet'!C70","v":" "},{"$f":"'Data Entry Sheet'!D70","v":0},{"$f":"'Data Entry Sheet'!E70","v":0},{"$f":"'Data Entry Sheet'!F70","v":0},{"$f":"'Data Entry Sheet'!G70","v":""},{"$f":"'Data Entry Sheet'!H70","v":0},{"$f":"'Data Entry Sheet'!I70","v":0},{"$f":"'Data Entry Sheet'!J70","v":" "},{"$f":"'Data Entry Sheet'!K70","v":""},null,"0 0000","---"]
[null,"",null,{"$f":"'Data Entry Sheet'!B71 & 'Data Entry Sheet'!C71 & 'Data Entry Sheet'!D71 & 'Data Entry Sheet'!E71 & 'Data Entry Sheet'!F71","v":" "},{"$f":"'Data Entry Sheet'!H71","v":0},null,null,null,null,null,null,null,null,null,null,null,55,null,{"$f":"'Data Entry Sheet'!B71","v":0},{"$f":"'Data Entry Sheet'!C71","v":" "},{"$f":"'Data Entry Sheet'!D71","v":0},{"$f":"'Data Entry Sheet'!E71","v":0},{"$f":"'Data Entry Sheet'!F71","v":0},{"$f":"'Data Entry Sheet'!G71","v":""},{"$f":"'Data Entry Sheet'!H71","v":0},{"$f":"'Data Entry Sheet'!I71","v":0},{"$f":"'Data Entry Sheet'!J71","v":" "},{"$f":"'Data Entry Sheet'!K71","v":""},null,"0 0000","---"]
[null,"",null,{"$f":"'Data Entry Sheet'!B72 & 'Data Entry Sheet'!C72 & 'Data Entry Sheet'!D72 & 'Data Entry Sheet'!E72 & 'Data Entry Sheet'!F72","v":" "},{"$f":"'Data Entry Sheet'!H72","v":0},null,null,null,null,null,null,null,null,null,null,null,56,null,{"$f":"'Data Entry Sheet'!B72","v":0},{"$f":"'Data Entry Sheet'!C72","v":" "},{"$f":"'Data Entry Sheet'!D72","v":0},{"$f":"'Data Entry Sheet'!E72","v":0},{"$f":"'Data Entry Sheet'!F72","v":0},{"$f":"'Data Entry Sheet'!G72","v":""},{"$f":"'Data Entry Sheet'!H72","v":0},{"$f":"'Data Entry Sheet'!I72","v":0},{"$f":"'Data Entry Sheet'!J72","v":" "},{"$f":"'Data Entry Sheet'!K72","v":""},null,"0 0000","---"]
[null,"",null,{"$f":"'Data Entry Sheet'!B73 & 'Data Entry Sheet'!C73 & 'Data Entry Sheet'!D73 & 'Data Entry Sheet'!E73 & 'Data Entry Sheet'!F73","v":" "},{"$f":"'Data Entry Sheet'!H73","v":0},null,null,null,null,null,null,null,null,null,null,null,57,null,{"$f":"'Data Entry Sheet'!B73","v":0},{"$f":"'Data Entry Sheet'!C73","v":" "},{"$f":"'Data Entry Sheet'!D73","v":0},{"$f":"'Data Entry Sheet'!E73","v":0},{"$f":"'Data Entry Sheet'!F73","v":0},{"$f":"'Data Entry Sheet'!G73","v":""},{"$f":"'Data Entry Sheet'!H73","v":0},{"$f":"'Data Entry Sheet'!I73","v":0},{"$f":"'Data Entry Sheet'!J73","v":" "},{"$f":"'Data Entry Sheet'!K73","v":""},null,"0 0000","---"]
[null,"",null,{"$f":"'Data Entry Sheet'!B74 & 'Data Entry Sheet'!C74 & 'Data Entry Sheet'!D74 & 'Data Entry Sheet'!E74 & 'Data Entry Sheet'!F74","v":" "},{"$f":"'Data Entry Sheet'!H74","v":0},null,null,null,null,null,null,null,null,null,null,null,58,null,{"$f":"'Data Entry Sheet'!B74","v":0},{"$f":"'Data Entry Sheet'!C74","v":" "},{"$f":"'Data Entry Sheet'!D74","v":0},{"$f":"'Data Entry Sheet'!E74","v":0},{"$f":"'Data Entry Sheet'!F74","v":0},{"$f":"'Data Entry Sheet'!G74","v":""},{"$f":"'Data Entry Sheet'!H74","v":0},{"$f":"'Data Entry Sheet'!I74","v":0},{"$f":"'Data Entry Sheet'!J74","v":" "},{"$f":"'Data Entry Sheet'!K74","v":""},null,"0 0000","---"]
[null,"",null,{"$f":"'Data Entry Sheet'!B75 & 'Data Entry Sheet'!C75 & 'Data Entry Sheet'!D75 & 'Data Entry Sheet'!E75 & 'Data Entry Sheet'!F75","v":" "},{"$f":"'Data Entry Sheet'!H75","v":0},null,null,null,null,null,null,null,null,null,null,null,59,null,{"$f":"'Data Entry Sheet'!B75","v":0},{"$f":"'Data Entry Sheet'!C75","v":" "},{"$f":"'Data Entry Sheet'!D75","v":0},{"$f":"'Data Entry Sheet'!E75","v":0},{"$f":"'Data Entry Sheet'!F75","v":0},{"$f":"'Data Entry Sheet'!G75","v":""},{"$f":"'Data Entry Sheet'!H75","v":0},{"$f":"'Data Entry Sheet'!I75","v":0},{"$f":"'Data Entry Sheet'!J75","v":" "},{"$f":"'Data Entry Sheet'!K75","v":""},null,"0 0000","---"]
[null,"",null,{"$f":"'Data Entry Sheet'!B76 & 'Data Entry Sheet'!C76 & 'Data Entry Sheet'!D76 & 'Data Entry Sheet'!E76 & 'Data Entry Sheet'!F76","v":" "},{"$f":"'Data Entry Sheet'!H76","v":0},null,null,null,null,null,null,null,null,null,null,null,60,null,{"$f":"'Data Entry Sheet'!B76","v":0},{"$f":"'Data Entry Sheet'!C76","v":" "},{"$f":"'Data Entry Sheet'!D76","v":0},{"$f":"'Data Entry Sheet'!E76","v":0},{"$f":"'Data Entry Sheet'!F76","v":0},{"$f":"'Data Entry Sheet'!G76","v":""},{"$f":"'Data Entry Sheet'!H76","v":0},{"$f":"'Data Entry Sheet'!I76","v":0},{"$f":"'Data Entry Sheet'!J76","v":" "},{"$f":"'Data Entry Sheet'!K76","v":""},null,"0 0000","---"]
[null,"",null,{"$f":"'Data Entry Sheet'!B77 & 'Data Entry Sheet'!C77 & 'Data Entry Sheet'!D77 & 'Data Entry Sheet'!E77 & 'Data Entry Sheet'!F77","v":" "},{"$f":"'Data Entry Sheet'!H77","v":0},null,null,null,null,null,null,null,null,null,null,null,61,null,{"$f":"'Data Entry Sheet'!B77","v":0},{"$f":"'Data Entry Sheet'!C77","v":" "},{"$f":"'Data Entry Sheet'!D77","v":0},{"$f":"'Data Entry Sheet'!E77","v":0},{"$f":"'Data Entry Sheet'!F77","v":0},{"$f":"'Data Entry Sheet'!G77","v":""},{"$f":"'Data Entry Sheet'!H77","v":0},{"$f":"'Data Entry Sheet'!I77","v":0},{"$f":"'Data Entry Sheet'!J77","v":" "},{"$f":"'Data Entry Sheet'!K77","v":""},null,"0 0000","---"]
[null,"",null,{"$f":"'Data Entry Sheet'!B78 & 'Data Entry Sheet'!C78 & 'Data Entry Sheet'!D78 & 'Data Entry Sheet'!E78 & 'Data Entry Sheet'!F78","v":" "},{"$f":"'Data Entry Sheet'!H78","v":0},null,null,null,null,null,null,null,null,null,null,null,62,null,{"$f":"'Data Entry Sheet'!B78","v":0},{"$f":"'Data Entry Sheet'!C78","v":" "},{"$f":"'Data Entry Sheet'!D78","v":0},{"$f":"'Data Entry Sheet'!E78","v":0},{"$f":"'Data Entry Sheet'!F78","v":0},{"$f":"'Data Entry Sheet'!G78","v":""},{"$f":"'Data Entry Sheet'!H78","v":0},{"$f":"'Data Entry Sheet'!I78","v":0},{"$f":"'Data Entry Sheet'!J78","v":" "},{"$f":"'Data Entry Sheet'!K78","v":""},null,"0 0000","---"]
[null,"",null,{"$f":"'Data Entry Sheet'!B79 & 'Data Entry Sheet'!C79 & 'Data Entry Sheet'!D79 & 'Data Entry Sheet'!E79 & 'Data Entry Sheet'!F79","v":" "},{"$f":"'Data Entry Sheet'!H79","v":0},null,null,null,null,null,null,null,null,null,null,null,63,null,{"$f":"'Data Entry Sheet'!B79","v":0},{"$f":"'Data Entry Sheet'!C79","v":" "},{"$f":"'Data Entry Sheet'!D79","v":0},{"$f":"'Data Entry Sheet'!E79","v":0},{"$f":"'Data Entry Sheet'!F79","v":0},{"$f":"'Data Entry Sheet'!G79","v":""},{"$f":"'Data Entry Sheet'!H79","v":0},{"$f":"'Data Entry Sheet'!I79","v":0},{"$f":"'Data Entry Sheet'!J79","v":" "},{"$f":"'Data Entry Sheet'!K79","v":""},null,"0 0000","---"]
[null,"",null,{"$f":"'Data Entry Sheet'!B80 & 'Data Entry Sheet'!C80 & 'Data Entry Sheet'!D80 & 'Data Entry Sheet'!E80 & 'Data Entry Sheet'!F80","v":" "},{"$f":"'Data Entry Sheet'!H80","v":0},null,null,null,null,null,null,null,null,null,null,null,64,null,{"$f":"'Data Entry Sheet'!B80","v":0},{"$f":"'Data Entry Sheet'!C80","v":" "},{"$f":"'Data Entry Sheet'!D80","v":0},{"$f":"'Data Entry Sheet'!E80","v":0},{"$f":"'Data Entry Sheet'!F80","v":0},{"$f":"'Data Entry Sheet'!G80","v":""},{"$f":"'Data Entry Sheet'!H80","v":0},{"$f":"'Data Entry Sheet'!I80","v":0},{"$f":"'Data Entry Sheet'!J80","v":" "},{"$f":"'Data Entry Sheet'!K80","v":""},null,"0 0000","---"]

{"sheet":"Dymo 450 Cabinet Labels","index":3,"n_rows":43,"n_cols":27,"rows_kept":43,"cut":false,"hidden":false,"merged":[[6,0,21,0]]}
[null,null,null,null,null,null,null,null,null,null,null,null,null,null,null,null,null,null,null,null,null,null,null,null,null,null,"NB"]
[null,null,null,null,"Select Directions for Phase 2 and Phase 4, then click 'Complete Labels' for standard Labels",null,null,null,null,null,null,null,null,null,null,null,null,null,null,null,null,null,null,null,null,null,"SB"]
[null,null,"CH- 7","Phase 2 =","NB",null,null,null,null,null,null,null,null,null,null,null,null,null,null,null,null,null,null,null,null,null,"EB"]
[null,null,null,"Phase 4 = ","EB",null,null,null,null,null,null,null,null,null,null,null,null,null,null,null,null,null,null,null,null,null,"WB"]
[]
[null," ' x'","Loadswitch CH","Controller PH","Label-1","Label-2"]
["Place an 'x' for Labels to be Printed","x","CH- 1","PH- 1","SL","WR",null,"CH- 7",null,{"$f":"H7","v":"CH- 7"}]
[null,"x","CH- 2","PH- 2","NB",null,null,"OLB",null,{"$f":"H8","v":"OLB"}]
[null,"x","CH- 3","PH- 3","WL","NR",null,"WB Ramp",null,{"$f":"H9","v":"WB Ramp"}]
[null,"x","CH- 4","PH- 4","EB"]
[null,"x","CH- 5","PH- 5","NL","ER"]
[null,"x","CH- 6","PH- 6","SB"]
[null,"x","CH- 7","PH- 7","EL","SR"]
[null,"x","CH- 8","PH- 8","WB"]
[null,null,"CH- 9 PED","PH- 2 NB","NE CRN","SE CRN"]
[null,null,"CH- 10 PED","PH- 4 EB","SE CRN","SW CRN"]
[null,null,"CH- 11 PED","PH- 6 SB","SW CRN","NW CRN"]
[null,null,"CH- 12 PED","PH- 8 WB","NW CRN","NE CRN"]
[null,null,"CH- 13","OLA","WR- 1,8"]
[null,null,"CH- 14","OLB","NR- 2,3"]
[null,null,"CH- 15","OL15","ER- 4,5"]
[null,null,"CH- 16","OL16","SR- 6,7"]
[]
[null,null,"PED PB- 1","PH- 2 NB","NE CRN","SE CRN"]
[null,null,"PED PB- 2","PH- 4 EB","SE CRN","SW CRN"]
[null,null,"PED PB- 3","PH- 6 SB","SW CRN","NW CRN"]
[null,null,"PED PB- 4","PH- 8 WB","NW CRN","NE CRN"]
[]
[null,null,"I/C- CH1","Fiber","North","South"]
[null,"x","I/C- CH1","Radio","Power","Antenna"]
[null,null,"I/C- CH1","6pr/19","North","South"]
[null,null,"I/C- Hardwire","7c/14","North","South"]
[]
[null,null,"IP","Modem","Power","Antenna"]
[null,null,"Cellular","Modem","Power","Antenna"]
[null,null,"Land-Line","Modem","Power","Phone Cable"]
[]
[null,null,"Power","DC","12v","Logic GND"]
[null,"x","Power","DC","24v","Logic GND"]
[]
[null,"x","Power","AC","120v","Neutral"]
[null,"x","Power","AC","GROUND"]
[null,null,"GROUND","#4/20/2009#","2.3 ohms"]

{"sheet":"Form Setup","index":4,"n_rows":13,"n_cols":5,"rows_kept":13,"cut":false,"hidden":false,"merged":[]}
[]
[]
[null,"Enter the following Forms to use with the Dymo 450 Labelmaker"]
[]
[null,"Start Menu/Settings/Printers and Faxes"]
[null,"File/Server Properties"]
[]
[null,"Form Name","Width","Height","Orientation for Printing"]
[null,"Detector Rack- ",0.73,13.5,"Landscape"]
[null,"Detector Panel- ",0.48,1.45,"Landscape"]
[null,"Detector Panel Loop Nos- ",0.47,4.75,"Portrait"]
[null,"Detector Lead-in Label- ",0.95,4,"Landscape"]
[null,"Signal Cabinet Label-",0.95,4,"Landscape"]

{"sheet":"Rack Layout","index":5,"n_rows":31,"n_cols":10,"rows_kept":31,"cut":false,"hidden":false,"merged":[[3,0,3,1],[4,0,4,1],[11,0,11,1],[12,0,12,1],[6,0,6,1],[14,0,14,1],[22,0,22,1],[30,0,30,1],[19,0,19,1],[20,0,20,1],[27,0,27,1],[28,0,28,1]]}
[{"$f":"'Data Entry Sheet'!E11","v":0},null,{"$f":"'Data Entry Sheet'!E12 & \"; Main Line is \" & 'Data Entry Sheet'!E13","v":"; Main Line is "}]
["Detectors 1-16",null,3,1,7,5,11,9,15,13]
[null,null,4,2,8,6,12,10,16,14]
["Rack 1",null,"Slot 1","Slot 2","Slot 3","Slot 4","Slot 5","Slot 6","Slot 7","Slot 8"]
["BIU 9"]
[null,null,{"$f":"IF(COUNTIF('Data Entry Sheet'!$B$17:$B$80,C2)>0,VLOOKUP(C2,'Data Entry Sheet'!$B$17:$L$80,11,FALSE),\" \")","v":" "},{"$f":"IF(COUNTIF('Data Entry Sheet'!$B$17:$B$80,D2)>0,VLOOKUP(D2,'Data Entry Sheet'!$B$17:$L$80,11,FALSE),\" \")","v":" "},{"$f":"IF(COUNTIF('Data Entry Sheet'!$B$17:$B$80,E2)>0,VLOOKUP(E2,'Data Entry Sheet'!$B$17:$L$80,11,FALSE),\" \")","v":" "},{"$f":"IF(COUNTIF('Data Entry Sheet'!$B$17:$B$80,F2)>0,VLOOKUP(F2,'Data Entry Sheet'!$B$17:$L$80,11,FALSE),\" \")","v":" "},{"$f":"IF(COUNTIF('Data Entry Sheet'!$B$17:$B$80,G2)>0,VLOOKUP(G2,'Data Entry Sheet'!$B$17:$L$80,11,FALSE),\" \")","v":" "},{"$f":"IF(COUNTIF('Data Entry Sheet'!$B$17:$B$80,H2)>0,VLOOKUP(H2,'Data Entry Sheet'!$B$17:$L$80,11,FALSE),\" \")","v":" "},{"$f":"IF(COUNTIF('Data Entry Sheet'!$B$17:$B$80,I2)>0,VLOOKUP(I2,'Data Entry Sheet'!$B$17:$L$80,11,FALSE),\" \")","v":" "},{"$f":"IF(COUNTIF('Data Entry Sheet'!$B$17:$B$80,J2)>0,VLOOKUP(J2,'Data Entry Sheet'!$B$17:$L$80,11,FALSE),\" \")","v":" "}]
["1-16",null,{"$f":"IF(COUNTIF('Data Entry Sheet'!$B$17:$B$80,C3)>0,VLOOKUP(C3,'Data Entry Sheet'!$B$17:$L$80,11,FALSE),\" \")","v":" "},{"$f":"IF(COUNTIF('Data Entry Sheet'!$B$17:$B$80,D3)>0,VLOOKUP(D3,'Data Entry Sheet'!$B$17:$L$80,11,FALSE),\" \")","v":" "},{"$f":"IF(COUNTIF('Data Entry Sheet'!$B$17:$B$80,E3)>0,VLOOKUP(E3,'Data Entry Sheet'!$B$17:$L$80,11,FALSE),\" \")","v":" "},{"$f":"IF(COUNTIF('Data Entry Sheet'!$B$17:$B$80,F3)>0,VLOOKUP(F3,'Data Entry Sheet'!$B$17:$L$80,11,FALSE),\" \")","v":" "},{"$f":"IF(COUNTIF('Data Entry Sheet'!$B$17:$B$80,G3)>0,VLOOKUP(G3,'Data Entry Sheet'!$B$17:$L$80,11,FALSE),\" \")","v":" "},{"$f":"IF(COUNTIF('Data Entry Sheet'!$B$17:$B$80,H3)>0,VLOOKUP(H3,'Data Entry Sheet'!$B$17:$L$80,11,FALSE),\" \")","v":" "},{"$f":"IF(COUNTIF('Data Entry Sheet'!$B$17:$B$80,I3)>0,VLOOKUP(I3,'Data Entry Sheet'!$B$17:$L$80,11,FALSE),\" \")","v":" "},{"$f":"IF(COUNTIF('Data Entry Sheet'!$B$17:$B$80,J3)>0,VLOOKUP(J3,'Data Entry Sheet'!$B$17:$L$80,11,FALSE),\" \")","v":" "}]
[]
[]
["Detectors 17-32",null,{"$f":"C2+16","v":19},{"$f":"D2+16","v":17},23,21,27,25,31,29]
[null,null,{"$f":"C3+16","v":20},{"$f":"D3+16","v":18},24,22,28,26,32,30]
["Rack 2",null,"Slot 1","Slot 2","Slot 3","Slot 4","Slot 5","Slot 6","Slot 7","Slot 8"]
["BIU 10"]
[null,null,{"$f":"IF(COUNTIF('Data Entry Sheet'!$B$17:$B$80,C10)>0,VLOOKUP(C10,'Data Entry Sheet'!$B$17:$L$80,11,FALSE),\" \")","v":" "},{"$f":"IF(COUNTIF('Data Entry Sheet'!$B$17:$B$80,D10)>0,VLOOKUP(D10,'Data Entry Sheet'!$B$17:$L$80,11,FALSE),\" \")","v":" "},{"$f":"IF(COUNTIF('Data Entry Sheet'!$B$17:$B$80,E10)>0,VLOOKUP(E10,'Data Entry Sheet'!$B$17:$L$80,11,FALSE),\" \")","v":" "},{"$f":"IF(COUNTIF('Data Entry Sheet'!$B$17:$B$80,F10)>0,VLOOKUP(F10,'Data Entry Sheet'!$B$17:$L$80,11,FALSE),\" \")","v":" "},{"$f":"IF(COUNTIF('Data Entry Sheet'!$B$17:$B$80,G10)>0,VLOOKUP(G10,'Data Entry Sheet'!$B$17:$L$80,11,FALSE),\" \")","v":" "},{"$f":"IF(COUNTIF('Data Entry Sheet'!$B$17:$B$80,H10)>0,VLOOKUP(H10,'Data Entry Sheet'!$B$17:$L$80,11,FALSE),\" \")","v":" "},{"$f":"IF(COUNTIF('Data Entry Sheet'!$B$17:$B$80,I10)>0,VLOOKUP(I10,'Data Entry Sheet'!$B$17:$L$80,11,FALSE),\" \")","v":" "},{"$f":"IF(COUNTIF('Data Entry Sheet'!$B$17:$B$80,J10)>0,VLOOKUP(J10,'Data Entry Sheet'!$B$17:$L$80,11,FALSE),\" \")","v":" "}]
["17-32",null,{"$f":"IF(COUNTIF('Data Entry Sheet'!$B$17:$B$80,C11)>0,VLOOKUP(C11,'Data Entry Sheet'!$B$17:$L$80,11,FALSE),\" \")","v":" "},{"$f":"IF(COUNTIF('Data Entry Sheet'!$B$17:$B$80,D11)>0,VLOOKUP(D11,'Data Entry Sheet'!$B$17:$L$80,11,FALSE),\" \")","v":" "},{"$f":"IF(COUNTIF('Data Entry Sheet'!$B$17:$B$80,E11)>0,VLOOKUP(E11,'Data Entry Sheet'!$B$17:$L$80,11,FALSE),\" \")","v":" "},{"$f":"IF(COUNTIF('Data Entry Sheet'!$B$17:$B$80,F11)>0,VLOOKUP(F11,'Data Entry Sheet'!$B$17:$L$80,11,FALSE),\" \")","v":" "},{"$f":"IF(COUNTIF('Data Entry Sheet'!$B$17:$B$80,G11)>0,VLOOKUP(G11,'Data Entry Sheet'!$B$17:$L$80,11,FALSE),\" \")","v":" "},{"$f":"IF(COUNTIF('Data Entry Sheet'!$B$17:$B$80,H11)>0,VLOOKUP(H11,'Data Entry Sheet'!$B$17:$L$80,11,FALSE),\" \")","v":" "},{"$f":"IF(COUNTIF('Data Entry Sheet'!$B$17:$B$80,I11)>0,VLOOKUP(I11,'Data Entry Sheet'!$B$17:$L$80,11,FALSE),\" \")","v":" "},{"$f":"IF(COUNTIF('Data Entry Sheet'!$B$17:$B$80,J11)>0,VLOOKUP(J11,'Data Entry Sheet'!$B$17:$L$80,11,FALSE),\" \")","v":" "}]
[]
[]
["Detectors 33-48",null,{"$f":"C10+16","v":35},{"$f":"D10+16","v":33},39,37,43,41,47,45]
[null,null,{"$f":"C11+16","v":36},{"$f":"D11+16","v":34},40,38,44,42,48,46]
["Rack 3",null,"Slot 1","Slot 2","Slot 3","Slot 4","Slot 5","Slot 6","Slot 7","Slot 8"]
["BIU 11"]
[null,null,{"$f":"IF(COUNTIF('Data Entry Sheet'!$B$17:$B$80,C18)>0,VLOOKUP(C18,'Data Entry Sheet'!$B$17:$L$80,11,FALSE),\" \")","v":" "},{"$f":"IF(COUNTIF('Data Entry Sheet'!$B$17:$B$80,D18)>0,VLOOKUP(D18,'Data Entry Sheet'!$B$17:$L$80,11,FALSE),\" \")","v":" "},{"$f":"IF(COUNTIF('Data Entry Sheet'!$B$17:$B$80,E18)>0,VLOOKUP(E18,'Data Entry Sheet'!$B$17:$L$80,11,FALSE),\" \")","v":" "},{"$f":"IF(COUNTIF('Data Entry Sheet'!$B$17:$B$80,F18)>0,VLOOKUP(F18,'Data Entry Sheet'!$B$17:$L$80,11,FALSE),\" \")","v":" "},{"$f":"IF(COUNTIF('Data Entry Sheet'!$B$17:$B$80,G18)>0,VLOOKUP(G18,'Data Entry Sheet'!$B$17:$L$80,11,FALSE),\" \")","v":" "},{"$f":"IF(COUNTIF('Data Entry Sheet'!$B$17:$B$80,H18)>0,VLOOKUP(H18,'Data Entry Sheet'!$B$17:$L$80,11,FALSE),\" \")","v":" "},{"$f":"IF(COUNTIF('Data Entry Sheet'!$B$17:$B$80,I18)>0,VLOOKUP(I18,'Data Entry Sheet'!$B$17:$L$80,11,FALSE),\" \")","v":" "},{"$f":"IF(COUNTIF('Data Entry Sheet'!$B$17:$B$80,J18)>0,VLOOKUP(J18,'Data Entry Sheet'!$B$17:$L$80,11,FALSE),\" \")","v":" "}]
["33-48",null,{"$f":"IF(COUNTIF('Data Entry Sheet'!$B$17:$B$80,C19)>0,VLOOKUP(C19,'Data Entry Sheet'!$B$17:$L$80,11,FALSE),\" \")","v":" "},{"$f":"IF(COUNTIF('Data Entry Sheet'!$B$17:$B$80,D19)>0,VLOOKUP(D19,'Data Entry Sheet'!$B$17:$L$80,11,FALSE),\" \")","v":" "},{"$f":"IF(COUNTIF('Data Entry Sheet'!$B$17:$B$80,E19)>0,VLOOKUP(E19,'Data Entry Sheet'!$B$17:$L$80,11,FALSE),\" \")","v":" "},{"$f":"IF(COUNTIF('Data Entry Sheet'!$B$17:$B$80,F19)>0,VLOOKUP(F19,'Data Entry Sheet'!$B$17:$L$80,11,FALSE),\" \")","v":" "},{"$f":"IF(COUNTIF('Data Entry Sheet'!$B$17:$B$80,G19)>0,VLOOKUP(G19,'Data Entry Sheet'!$B$17:$L$80,11,FALSE),\" \")","v":" "},{"$f":"IF(COUNTIF('Data Entry Sheet'!$B$17:$B$80,H19)>0,VLOOKUP(H19,'Data Entry Sheet'!$B$17:$L$80,11,FALSE),\" \")","v":" "},{"$f":"IF(COUNTIF('Data Entry Sheet'!$B$17:$B$80,I19)>0,VLOOKUP(I19,'Data Entry Sheet'!$B$17:$L$80,11,FALSE),\" \")","v":" "},{"$f":"IF(COUNTIF('Data Entry Sheet'!$B$17:$B$80,J19)>0,VLOOKUP(J19,'Data Entry Sheet'!$B$17:$L$80,11,FALSE),\" \")","v":" "}]
[]
[]
["Detectors 49-64",null,{"$f":"C18+16","v":51},{"$f":"D18+16","v":49},55,53,59,57,63,61]
[null,null,{"$f":"C19+16","v":52},{"$f":"D19+16","v":50},56,54,60,58,64,62]
["Rack 4",null,"Slot 1","Slot 2","Slot 3","Slot 4","Slot 5","Slot 6","Slot 7","Slot 8"]
["BIU 12"]
[null,null,{"$f":"IF(COUNTIF('Data Entry Sheet'!$B$17:$B$80,C26)>0,VLOOKUP(C26,'Data Entry Sheet'!$B$17:$L$80,11,FALSE),\" \")","v":" "},{"$f":"IF(COUNTIF('Data Entry Sheet'!$B$17:$B$80,D26)>0,VLOOKUP(D26,'Data Entry Sheet'!$B$17:$L$80,11,FALSE),\" \")","v":" "},{"$f":"IF(COUNTIF('Data Entry Sheet'!$B$17:$B$80,E26)>0,VLOOKUP(E26,'Data Entry Sheet'!$B$17:$L$80,11,FALSE),\" \")","v":" "},{"$f":"IF(COUNTIF('Data Entry Sheet'!$B$17:$B$80,F26)>0,VLOOKUP(F26,'Data Entry Sheet'!$B$17:$L$80,11,FALSE),\" \")","v":" "},{"$f":"IF(COUNTIF('Data Entry Sheet'!$B$17:$B$80,G26)>0,VLOOKUP(G26,'Data Entry Sheet'!$B$17:$L$80,11,FALSE),\" \")","v":" "},{"$f":"IF(COUNTIF('Data Entry Sheet'!$B$17:$B$80,H26)>0,VLOOKUP(H26,'Data Entry Sheet'!$B$17:$L$80,11,FALSE),\" \")","v":" "},{"$f":"IF(COUNTIF('Data Entry Sheet'!$B$17:$B$80,I26)>0,VLOOKUP(I26,'Data Entry Sheet'!$B$17:$L$80,11,FALSE),\" \")","v":" "},{"$f":"IF(COUNTIF('Data Entry Sheet'!$B$17:$B$80,J26)>0,VLOOKUP(J26,'Data Entry Sheet'!$B$17:$L$80,11,FALSE),\" \")","v":" "}]
["49-64",null,{"$f":"IF(COUNTIF('Data Entry Sheet'!$B$17:$B$80,C27)>0,VLOOKUP(C27,'Data Entry Sheet'!$B$17:$L$80,11,FALSE),\" \")","v":" "},{"$f":"IF(COUNTIF('Data Entry Sheet'!$B$17:$B$80,D27)>0,VLOOKUP(D27,'Data Entry Sheet'!$B$17:$L$80,11,FALSE),\" \")","v":" "},{"$f":"IF(COUNTIF('Data Entry Sheet'!$B$17:$B$80,E27)>0,VLOOKUP(E27,'Data Entry Sheet'!$B$17:$L$80,11,FALSE),\" \")","v":" "},{"$f":"IF(COUNTIF('Data Entry Sheet'!$B$17:$B$80,F27)>0,VLOOKUP(F27,'Data Entry Sheet'!$B$17:$L$80,11,FALSE),\" \")","v":" "},{"$f":"IF(COUNTIF('Data Entry Sheet'!$B$17:$B$80,G27)>0,VLOOKUP(G27,'Data Entry Sheet'!$B$17:$L$80,11,FALSE),\" \")","v":" "},{"$f":"IF(COUNTIF('Data Entry Sheet'!$B$17:$B$80,H27)>0,VLOOKUP(H27,'Data Entry Sheet'!$B$17:$L$80,11,FALSE),\" \")","v":" "},{"$f":"IF(COUNTIF('Data Entry Sheet'!$B$17:$B$80,I27)>0,VLOOKUP(I27,'Data Entry Sheet'!$B$17:$L$80,11,FALSE),\" \")","v":" "},{"$f":"IF(COUNTIF('Data Entry Sheet'!$B$17:$B$80,J27)>0,VLOOKUP(J27,'Data Entry Sheet'!$B$17:$L$80,11,FALSE),\" \")","v":" "}]