{"text_format":"1","workbook":"xlsx","n_sheets":6,"sheets":["Data Entry Sheet","Dymo 450 Rack Labels","Dymo 450 Lead-In Labels","Dymo 450 Cabinet Labels","Form Setup","Rack Layout"],"not_rendered":{"charts":0,"images":13,"macros":1,"external_links":0,"defined_names":5,"comments":0,"pivot_tables":0},"unopened":[],"bounds":{"document_bytes":16777216,"sheet_cells":100000,"rows_first":2000,"rows_last":500,"rows_between":2000,"halvings":0,"cell_chars":16384,"cell_head_chars":4096},"cells_cut":0,"cells_raw":0,"read":"whole","date_system":"1900"}

{"sheet":"Data Entry Sheet","index":0,"n_rows":80,"n_cols":66,"rows_kept":80,"cut":false,"hidden":false,"merged":[[14,13,14,20]]}
[null,null,null,null,"Loop Tagging Table Work Sheet",null,null,null,null,null,null,null,null,null,"Rev. 1.78",null,null,null,null,null,null,null,null,null,null,null,null,null,null,null,null,null,null,null,null,null,null,null,null,null,null,null,null,null,null,null,null,null,null,null,null,"=IF(I17 = \"C\", B17+2,\"\")"]
[]
[null,"1.  Enter the Loop Tagging information from Loop Tagging Table on the design plan.  "]
[null,"2.  Add the Loop No and C (for Counting).  The Count No will be set two numbers higher than the Loop No but may be changed if needed."]
[null,"3.  When complete click the \"Sort Loop Tagging Table\" button "]
[null,"4.  Print Detailed Loop Tagging Table, Detector Rack and Loop Lead-in Labels"]
[null,"*** Each Loop Panel shall be labeled with it's coresponding Loop Nos (1-16); (17-32); (33-48); (49-64) along with each individual Loop No"]
[null,"*** Each Detector Rack shall be labeled with it's coresponding Detector Channels (1-16); (17-32); (33-48); (49-64) along with the Loop tag information"]
[]
[null,null,null,null,null,null,null,"Date Effective:"]
{"$rows_left_out":71}
{"sheet":"Dymo 450 Rack Labels","index":1,"n_rows":64,"n_cols":26,"rows_kept":64,"cut":false,"hidden":false,"merged":[]}
[null,null,null,null,null,null,null,null,null,null,null,null,null,{"$f":"'Data Entry Sheet'!B17","v":0},{"$f":"'Data Entry Sheet'!C17","v":" "},{"$f":"'Data Entry Sheet'!D17","v":0},{"$f":"'Data Entry Sheet'!E17","v":0},{"$f":"'Data Entry Sheet'!F17","v":0},{"$f":"'Data Entry Sheet'!G17","v":""},{"$f":"'Data Entry Sheet'!H17","v":0},{"$f":"'Data Entry Sheet'!I17","v":0},{"$f":"'Data Entry Sheet'!J17","v":" "},{"$f":"'Data Entry Sheet'!K17","v":""},null,{"$f":"N1&O1&P1&Q1&R1&S1&T1","v":"0 0000"},{"$f":"IF(U1 = \"C\", U1&V1&W1, \"---\")","v":"---"}]
[null,null,null,null,null,null,null,null,null,null,null,null,null,{"$f":"'Data Entry Sheet'!B18","v":0},{"$f":"'Data Entry Sheet'!C18","v":" "},{"$f":"'Data Entry Sheet'!D18","v":0},{"$f":"'Data Entry Sheet'!E18","v":0},{"$f":"'Data Entry Sheet'!F18","v":0},{"$f":"'Data Entry Sheet'!G18","v":""},{"$f":"'Data Entry Sheet'!H18","v":0},{"$f":"'Data Entry Sheet'!I18","v":0},{"$f":"'Data Entry Sheet'!J18","v":" "},{"$f":"'Data Entry Sheet'!K18","v":""},null,{"$f":"N2&O2&P2&Q2&R2&S2&T2","v":"0 0000"},{"$f":"IF(U2 = \"C\", U2&V2&W2, \"---\")","v":"---"}]
[null,null,null,null,null,null,null,null,null,null,null,null,null,{"$f":"'Data Entry Sheet'!B19","v":0},{"$f":"'Data Entry Sheet'!C19","v":" "},{"$f":"'Data Entry Sheet'!D19","v":0},{"$f":"'Data Entry Sheet'!E19","v":0},{"$f":"'Data Entry Sheet'!F19","v":0},{"$f":"'Data Entry Sheet'!G19","v":""},{"$f":"'Data Entry Sheet'!H19","v":0},{"$f":"'Data Entry Sheet'!I19","v":0},{"$f":"'Data Entry Sheet'!J19","v":" "},{"$f":"'Data Entry Sheet'!K19","v":""},null,"0 0000","---"]
["Diamond Interchange Ramp      ==>",null,null,null,null,null,null,null,null,null,null,null,null,{"$f":"'Data Entry Sheet'!B20","v":0},{"$f":"'Data Entry Sheet'!C20","v":" "},{"$f":"'Data Entry Sheet'!D20","v":0},{"$f":"'Data Entry Sheet'!E20","v":0},{"$f":"'Data Entry Sheet'!F20","v":0},{"$f":"'Data Entry Sheet'!G20","v":""},{"$f":"'Data Entry Sheet'!H20","v":0},{"$f":"'Data Entry Sheet'!I20","v":0},{"$f":"'Data Entry Sheet'!J20","v":" "},{"$f":"'Data Entry Sheet'!K20","v":""},null,"0 0000","---"]
["Add Detector Rack comments below",null,null,null,null,null,null,null,null,null,null,null,null,{"$f":"'Data Entry Sheet'!B21","v":0},{"$f":"'Data Entry Sheet'!C21","v":" "},{"$f":"'Data Entry Sheet'!D21","v":0},{"$f":"'Data Entry Sheet'!E21","v":0},{"$f":"'Data Entry Sheet'!F21","v":0},{"$f":"'Data Entry Sheet'!G21","v":""},{"$f":"'Data Entry Sheet'!H21","v":0},{"$f":"'Data Entry Sheet'!I21","v":0},{"$f":"'Data Entry Sheet'!J21","v":" "},{"$f":"'Data Entry Sheet'!K21","v":""},null,"0 0000","---"]
[{"$f":"'Data Entry Sheet'!E11 & \" -- RACK 1 (1-16)\"","v":" -- RACK 1 (1-16)"},{"$f":"IF(COUNTIF($N$1:$N$64,3)>0,VLOOKUP(3,$N$1:$Z$64,12,FALSE),\"3-\")","v":"3-"},{"$f":"IF(COUNTIF($N$1:$N$64,1)>0,VLOOKUP(1,$N$1:$Z$64,12,FALSE),\"1-\")","v":"1-"},{"$f":"IF(COUNTIF($N$1:$N$64,7)>0,VLOOKUP(7,$N$1:$Z$64,12,FALSE),\"7-\")","v":"7-"},{"$f":"IF(COUNTIF($N$1:$N$64,5)>0,VLOOKUP(5,$N$1:$Z$64,12,FALSE),\"5-\")","v":"5-"},{"$f":"IF(COUNTIF($N$1:$N$64,11)>0,VLOOKUP(11,$N$1:$Z$64,12,FALSE),\"11-\")","v":"11-"},{"$f":"IF(COUNTIF($N$1:$N$64,9)>0,VLOOKUP(9,$N$1:$Z$64,12,FALSE),\"9-\")","v":"9-"},{"$f":"IF(COUNTIF($N$1:$N$64,15)>0,VLOOKUP(15,$N$1:$Z$64,12,FALSE),\"15-\")","v":"15-"},{"$f":"IF(COUNTIF($N$1:$N$64,13)>0,VLOOKUP(13,$N$1:$Z$64,12,FALSE),\"13-\")","v":"13-"},null,null,null,null,{"$f":"'Data Entry Sheet'!B22","v":0},{"$f":"'Data Entry Sheet'!C22","v":" "},{"$f":"'Data Entry Sheet'!D22","v":0},{"$f":"'Data Entry Sheet'!E22","v":0},{"$f":"'Data Entry Sheet'!F22","v":0},{"$f":"'Data Entry Sheet'!G22","v":""},{"$f":"'Data Entry Sheet'!H22","v":0},{"$f":"'Data Entry Sheet'!I22","v":0},{"$f":"'Data Entry Sheet'!J22","v":" "},{"$f":"'Data Entry Sheet'!K22","v":""},null,"0 0000","---"]
[{"$f":"IF(B4 = \"\", 'Data Entry Sheet'!E12, B4)","v":0},{"$f":"IF(COUNTIF($N$1:$N$64,3)>0,VLOOKUP(3,$N$1:$Z$64,13,FALSE),\"---\")","v":"---"},{"$f":"IF(COUNTIF($N$1:$N$64,1)>0,VLOOKUP(1,$N$1:$Z$64,13,FALSE),\"---\")","v":"---"},{"$f":"IF(COUNTIF($N$1:$N$64,7)>0,VLOOKUP(7,$N$1:$Z$64,13,FALSE),\"---\")","v":"---"},{"$f":"IF(COUNTIF($N$1:$N$64,5)>0,VLOOKUP(5,$N$1:$Z$64,13,FALSE),\"---\")","v":"---"},{"$f":"IF(COUNTIF($N$1:$N$64,11)>0,VLOOKUP(11,$N$1:$Z$64,13,FALSE),\"---\")","v":"---"},{"$f":"IF(COUNTIF($N$1:$N$64,9)>0,VLOOKUP(9,$N$1:$Z$64,13,FALSE),\"---\")","v":"---"},{"$f":"IF(COUNTIF($N$1:$N$64,15)>0,VLOOKUP(15,$N$1:$Z$64,13,FALSE),\"---\")","v":"---"},{"$f":"IF(COUNTIF($N$1:$N$64,13)>0,VLOOKUP(13,$N$1:$Z$64,13,FALSE),\"---\")","v":"---"},null,null,null,null,{"$f":"'Data Entry Sheet'!B23","v":0},{"$f":"'Data Entry Sheet'!C23","v":" "},{"$f":"'Data Entry Sheet'!D23","v":0},{"$f":"'Data Entry Sheet'!E23","v":0},{"$f":"'Data Entry Sheet'!F23","v":0},{"$f":"'Data Entry Sheet'!G23","v":""},{"$f":"'Data Entry Sheet'!H23","v":0},{"$f":"'Data Entry Sheet'!I23","v":0},{"$f":"'Data Entry Sheet'!J23","v":" "},{"$f":"'Data Entry Sheet'!K23","v":""},null,"0 0000","---"]
[null,{"$f":"IF(COUNTIF($N$1:$N$64,4)>0,VLOOKUP(4,$N$1:$Z$64,12,FALSE),\"4-\")","v":"4-"},{"$f":"IF(COUNTIF($N$1:$N$64,2)>0,VLOOKUP(2,$N$1:$Z$64,12,FALSE),\"2-\")","v":"2-"},{"$f":"IF(COUNTIF($N$1:$N$64,8)>0,VLOOKUP(8,$N$1:$Z$64,12,FALSE),\"8-\")","v":"8-"},{"$f":"IF(COUNTIF($N$1:$N$64,6)>0,VLOOKUP(6,$N$1:$Z$64,12,FALSE),\"6-\")","v":"6-"},{"$f":"IF(COUNTIF($N$1:$N$64,12)>0,VLOOKUP(12,$N$1:$Z$64,12,FALSE),\"12-\")","v":"12-"},{"$f":"IF(COUNTIF($N$1:$N$64,10)>0,VLOOKUP(10,$N$1:$Z$64,12,FALSE),\"10-\")","v":"10-"},{"$f":"IF(COUNTIF($N$1:$N$64,16)>0,VLOOKUP(16,$N$1:$Z$64,12,FALSE),\"16-\")","v":"16-"},{"$f":"IF(COUNTIF($N$1:$N$64,14)>0,VLOOKUP(14,$N$1:$Z$64,12,FALSE),\"14-\")","v":"14-"},null,null,null,null,{"$f":"'Data Entry Sheet'!B24","v":0},{"$f":"'Data Entry Sheet'!C24","v":" "},{"$f":"'Data Entry Sheet'!D24","v":0},{"$f":"'Data Entry Sheet'!E24","v":0},{"$f":"'Data Entry Sheet'!F24","v":0},{"$f":"'Data Entry Sheet'!G24","v":""},{"$f":"'Data Entry Sheet'!H24","v":0},{"$f":"'Data Entry Sheet'!I24","v":0},{"$f":"'Data Entry Sheet'!J24","v":" "},{"$f":"'Data Entry Sheet'!K24","v":""},null,"0 0000","---"]
[null,{"$f":"IF(COUNTIF($N$1:$N$64,4)>0,VLOOKUP(4,$N$1:$Z$64,13,FALSE),\"---\")","v":"---"},{"$f":"IF(COUNTIF($N$1:$N$64,2)>0,VLOOKUP(2,$N$1:$Z$64,13,FALSE),\"---\")","v":"---"},{"$f":"IF(COUNTIF($N$1:$N$64,8)>0,VLOOKUP(8,$N$1:$Z$64,13,FALSE),\"---\")","v":"---"},{"$f":"IF(COUNTIF($N$1:$N$64,6)>0,VLOOKUP(6,$N$1:$Z$64,13,FALSE),\"---\")","v":"---"},{"$f":"IF(COUNTIF($N$1:$N$64,12)>0,VLOOKUP(12,$N$1:$Z$64,13,FALSE),\"---\")","v":"---"},{"$f":"IF(COUNTIF($N$1:$N$64,10)>0,VLOOKUP(10,$N$1:$Z$64,13,FALSE),\"---\")","v":"---"},{"$f":"IF(COUNTIF($N$1:$N$64,16)>0,VLOOKUP(16,$N$1:$Z$64,13,FALSE),\"---\")","v":"---"},{"$f":"IF(COUNTIF($N$1:$N$64,14)>0,VLOOKUP(14,$N$1:$Z$64,13,FALSE),\"---\")","v":"---"},null,null,null,null,{"$f":"'Data Entry Sheet'!B25","v":0},{"$f":"'Data Entry Sheet'!C25","v":" "},{"$f":"'Data Entry Sheet'!D25","v":0},{"$f":"'Data Entry Sheet'!E25","v":0},{"$f":"'Data Entry Sheet'!F25","v":0},{"$f":"'Data Entry Sheet'!G25","v":""},{"$f":"'Data Entry Sheet'!H25","v":0},{"$f":"'Data Entry Sheet'!I25","v":0},{"$f":"'Data Entry Sheet'!J25","v":" "},{"$f":"'Data Entry Sheet'!K25","v":""},null,"0 0000","---"]
[null,null,null,null,null,null,null,null,null,null,null,null,null,{"$f":"'Data Entry Sheet'!B26","v":0},{"$f":"'Data Entry Sheet'!C26","v":" "},{"$f":"'Data Entry Sheet'!D26","v":0},{"$f":"'Data Entry Sheet'!E26","v":0},{"$f":"'Data Entry Sheet'!F26","v":0},{"$f":"'Data Entry Sheet'!G26","v":""},{"$f":"'Data Entry Sheet'!H26","v":0},{"$f":"'Data Entry Sheet'!I26","v":0},{"$f":"'Data Entry Sheet'!J26","v":" "},{"$f":"'Data Entry Sheet'!K26","v":""},null,"0 0000","---"]
{"$rows_left_out":55}
{"sheet":"Dymo 450 Lead-In Labels","index":2,"n_rows":66,"n_cols":37,"rows_kept":66,"cut":false,"hidden":false,"merged":[]}
[]
[null," Select"]
[null,"x",null,{"$f":"'Data Entry Sheet'!B17 & 'Data Entry Sheet'!C17 & 'Data Entry Sheet'!D17 & 'Data Entry Sheet'!E17 & 'Data Entry Sheet'!F17","v":" "},{"$f":"'Data Entry Sheet'!H17","v":0},null,null,null,null,null,null,null,null,"1-16",null,null,1,null,{"$f":"'Data Entry Sheet'!B17","v":0},{"$f":"'Data Entry Sheet'!C17","v":" "},{"$f":"'Data Entry Sheet'!D17","v":0},{"$f":"'Data Entry Sheet'!E17","v":0},{"$f":"'Data Entry Sheet'!F17","v":0},{"$f":"'Data Entry Sheet'!G17","v":""},{"$f":"'Data Entry Sheet'!H17","v":0},{"$f":"'Data Entry Sheet'!I17","v":0},{"$f":"'Data Entry Sheet'!J17","v":" "},{"$f":"'Data Entry Sheet'!K17","v":""},null,{"$f":"S3&T3&U3&V3&W3&X3&Y3","v":"0 0000"},{"$f":"IF(Z3 = \"C\", Z3&AA3&AB3, \"---\")","v":"---"},null,{"$f":"MAX(S3:S66)","v":0},null,"32-WA8",null,"32-WA8"]
[null,"x",null,{"$f":"'Data Entry Sheet'!B18 & 'Data Entry Sheet'!C18 & 'Data Entry Sheet'!D18 & 'Data Entry Sheet'!E18 & 'Data Entry Sheet'!F18","v":" "},{"$f":"'Data Entry Sheet'!H18","v":0},null,null,null,null,null,null,null,null,"17-32",null,null,2,null,{"$f":"'Data Entry Sheet'!B18","v":0},{"$f":"'Data Entry Sheet'!C18","v":" "},{"$f":"'Data Entry Sheet'!D18","v":0},{"$f":"'Data Entry Sheet'!E18","v":0},{"$f":"'Data Entry Sheet'!F18","v":0},{"$f":"'Data Entry Sheet'!G18","v":""},{"$f":"'Data Entry Sheet'!H18","v":0},{"$f":"'Data Entry Sheet'!I18","v":0},{"$f":"'Data Entry Sheet'!J18","v":" "},{"$f":"'Data Entry Sheet'!K18","v":""},null,{"$f":"S4&T4&U4&V4&W4&X4&Y4","v":"0 0000"},{"$f":"IF(Z4 = \"C\", Z4&AA4&AB4, \"---\")","v":"---"},null,null,null,"2,3,4",null,"2,3,4"]
[null,"x",null,{"$f":"'Data Entry Sheet'!B19 & 'Data Entry Sheet'!C19 & 'Data Entry Sheet'!D19 & 'Data Entry Sheet'!E19 & 'Data Entry Sheet'!F19","v":" "},{"$f":"'Data Entry Sheet'!H19","v":0},null,null,null,null,null,null,null,null,"33-48",null,null,3,null,{"$f":"'Data Entry Sheet'!B19","v":0},{"$f":"'Data Entry Sheet'!C19","v":" "},{"$f":"'Data Entry Sheet'!D19","v":0},{"$f":"'Data Entry Sheet'!E19","v":0},{"$f":"'Data Entry Sheet'!F19","v":0},{"$f":"'Data Entry Sheet'!G19","v":""},{"$f":"'Data Entry Sheet'!H19","v":0},{"$f":"'Data Entry Sheet'!I19","v":0},{"$f":"'Data Entry Sheet'!J19","v":" "},{"$f":"'Data Entry Sheet'!K19","v":""},null,"0 0000","---"]
[null,"x",null,{"$f":"'Data Entry Sheet'!B20 & 'Data Entry Sheet'!C20 & 'Data Entry Sheet'!D20 & 'Data Entry Sheet'!E20 & 'Data Entry Sheet'!F20","v":" "},{"$f":"'Data Entry Sheet'!H20","v":0},null,null,null,null,null,null,null,null,"49-64",null,null,4,null,{"$f":"'Data Entry Sheet'!B20","v":0},{"$f":"'Data Entry Sheet'!C20","v":" "},{"$f":"'Data Entry Sheet'!D20","v":0},{"$f":"'Data Entry Sheet'!E20","v":0},{"$f":"'Data Entry Sheet'!F20","v":0},{"$f":"'Data Entry Sheet'!G20","v":""},{"$f":"'Data Entry Sheet'!H20","v":0},{"$f":"'Data Entry Sheet'!I20","v":0},{"$f":"'Data Entry Sheet'!J20","v":" "},{"$f":"'Data Entry Sheet'!K20","v":""},null,"0 0000","---"]
[null,"x",null,{"$f":"'Data Entry Sheet'!B21 & 'Data Entry Sheet'!C21 & 'Data Entry Sheet'!D21 & 'Data Entry Sheet'!E21 & 'Data Entry Sheet'!F21","v":" "},{"$f":"'Data Entry Sheet'!H21","v":0},null,null,null,null,null,null,null,null,null,null,null,5,null,{"$f":"'Data Entry Sheet'!B21","v":0},{"$f":"'Data Entry Sheet'!C21","v":" "},{"$f":"'Data Entry Sheet'!D21","v":0},{"$f":"'Data Entry Sheet'!E21","v":0},{"$f":"'Data Entry Sheet'!F21","v":0},{"$f":"'Data Entry Sheet'!G21","v":""},{"$f":"'Data Entry Sheet'!H21","v":0},{"$f":"'Data Entry Sheet'!I21","v":0},{"$f":"'Data Entry Sheet'!J21","v":" "},{"$f":"'Data Entry Sheet'!K21","v":""},null,"0 0000","---"]
[null,"x",null,{"$f":"'Data Entry Sheet'!B22 & 'Data Entry Sheet'!C22 & 'Data Entry Sheet'!D22 & 'Data Entry Sheet'!E22 & 'Data Entry Sheet'!F22","v":" "},{"$f":"'Data Entry Sheet'!H22","v":0},null,null,null,null,null,null,null,null,null,null,null,6,null,{"$f":"'Data Entry Sheet'!B22","v":0},{"$f":"'Data Entry Sheet'!C22","v":" "},{"$f":"'Data Entry Sheet'!D22","v":0},{"$f":"'Data Entry Sheet'!E22","v":0},{"$f":"'Data Entry Sheet'!F22","v":0},{"$f":"'Data Entry Sheet'!G22","v":""},{"$f":"'Data Entry Sheet'!H22","v":0},{"$f":"'Data Entry Sheet'!I22","v":0},{"$f":"'Data Entry Sheet'!J22","v":" "},{"$f":"'Data Entry Sheet'!K22","v":""},null,"0 0000","---"]
[null,"x",null,{"$f":"'Data Entry Sheet'!B23 & 'Data Entry Sheet'!C23 & 'Data Entry Sheet'!D23 & 'Data Entry Sheet'!E23 & 'Data Entry Sheet'!F23","v":" "},{"$f":"'Data Entry Sheet'!H23","v":0},null,null,null,null,null,null,null,null,null,null,null,7,null,{"$f":"'Data Entry Sheet'!B23","v":0},{"$f":"'Data Entry Sheet'!C23","v":" "},{"$f":"'Data Entry Sheet'!D23","v":0},{"$f":"'Data Entry Sheet'!E23","v":0},{"$f":"'Data Entry Sheet'!F23","v":0},{"$f":"'Data Entry Sheet'!G23","v":""},{"$f":"'Data Entry Sheet'!H23","v":0},{"$f":"'Data Entry Sheet'!I23","v":0},{"$f":"'Data Entry Sheet'!J23","v":" "},{"$f":"'Data Entry Sheet'!K23","v":""},null,"0 0000","---"]
[null,"x",null,{"$f":"'Data Entry Sheet'!B24 & 'Data Entry Sheet'!C24 & 'Data Entry Sheet'!D24 & 'Data Entry Sheet'!E24 & 'Data Entry Sheet'!F24","v":" "},{"$f":"'Data Entry Sheet'!H24","v":0},null,null,null,null,null,null,null,null,null,null,null,8,null,{"$f":"'Data Entry Sheet'!B24","v":0},{"$f":"'Data Entry Sheet'!C24","v":" "},{"$f":"'Data Entry Sheet'!D24","v":0},{"$f":"'Data Entry Sheet'!E24","v":0},{"$f":"'Data Entry Sheet'!F24","v":0},{"$f":"'Data Entry Sheet'!G24","v":""},{"$f":"'Data Entry Sheet'!H24","v":0},{"$f":"'Data Entry Sheet'!I24","v":0},{"$f":"'Data Entry Sheet'!J24","v":" "},{"$f":"'Data Entry Sheet'!K24","v":""},null,"0 0000","---"]
{"$rows_left_out":57}
{"sheet":"Dymo 450 Cabinet Labels","index":3,"n_rows":43,"n_cols":27,"rows_kept":43,"cut":false,"hidden":false,"merged":[[6,0,21,0]]}
[null,null,null,null,null,null,null,null,null,null,null,null,null,null,null,null,null,null,null,null,null,null,null,null,null,null,"NB"]
[null,null,null,null,"Select Directions for Phase 2 and Phase 4, then click 'Complete Labels' for standard Labels",null,null,null,null,null,null,null,null,null,null,null,null,null,null,null,null,null,null,null,null,null,"SB"]
[null,null,"CH- 7","Phase 2 =","NB",null,null,null,null,null,null,null,null,null,null,null,null,null,null,null,null,null,null,null,null,null,"EB"]
[null,null,null,"Phase 4 = ","EB",null,null,null,null,null,null,null,null,null,null,null,null,null,null,null,null,null,null,null,null,null,"WB"]
[]
[null," ' x'","Loadswitch CH","Controller PH","Label-1","Label-2"]
["Place an 'x' for Labels to be Printed","x","CH- 1","PH- 1","SL","WR",null,"CH- 7",null,{"$f":"H7","v":"CH- 7"}]
[null,"x","CH- 2","PH- 2","NB",null,null,"OLB",null,{"$f":"H8","v":"OLB"}]
[null,"x","CH- 3","PH- 3","WL","NR",null,"WB Ramp",null,{"$f":"H9","v":"WB Ramp"}]
[null,"x","CH- 4","PH- 4","EB"]
{"$rows_left_out":34}
{"sheet":"Form Setup","index":4,"n_rows":13,"n_cols":5,"rows_kept":13,"cut":false,"hidden":false,"merged":[]}
[]
[]
[null,"Enter the following Forms to use with the Dymo 450 Labelmaker"]
[]
[null,"Start Menu/Settings/Printers and Faxes"]
[null,"File/Server Properties"]
[]
[null,"Form Name","Width","Height","Orientation for Printing"]
[null,"Detector Rack- ",0.73,13.5,"Landscape"]
[null,"Detector Panel- ",0.48,1.45,"Landscape"]
{"$rows_left_out":4}
{"sheet":"Rack Layout","index":5,"n_rows":31,"n_cols":10,"rows_kept":31,"cut":false,"hidden":false,"merged":[[3,0,3,1],[4,0,4,1],[11,0,11,1],[12,0,12,1],[6,0,6,1],[14,0,14,1],[22,0,22,1],[30,0,30,1],[19,0,19,1],[20,0,20,1],[27,0,27,1],[28,0,28,1]]}
[{"$f":"'Data Entry Sheet'!E11","v":0},null,{"$f":"'Data Entry Sheet'!E12 & \"; Main Line is \" & 'Data Entry Sheet'!E13","v":"; Main Line is "}]
["Detectors 1-16",null,3,1,7,5,11,9,15,13]
[null,null,4,2,8,6,12,10,16,14]
["Rack 1",null,"Slot 1","Slot 2","Slot 3","Slot 4","Slot 5","Slot 6","Slot 7","Slot 8"]
["BIU 9"]
[null,null,{"$f":"IF(COUNTIF('Data Entry Sheet'!$B$17:$B$80,C2)>0,VLOOKUP(C2,'Data Entry Sheet'!$B$17:$L$80,11,FALSE),\" \")","v":" "},{"$f":"IF(COUNTIF('Data Entry Sheet'!$B$17:$B$80,D2)>0,VLOOKUP(D2,'Data Entry Sheet'!$B$17:$L$80,11,FALSE),\" \")","v":" "},{"$f":"IF(COUNTIF('Data Entry Sheet'!$B$17:$B$80,E2)>0,VLOOKUP(E2,'Data Entry Sheet'!$B$17:$L$80,11,FALSE),\" \")","v":" "},{"$f":"IF(COUNTIF('Data Entry Sheet'!$B$17:$B$80,F2)>0,VLOOKUP(F2,'Data Entry Sheet'!$B$17:$L$80,11,FALSE),\" \")","v":" "},{"$f":"IF(COUNTIF('Data Entry Sheet'!$B$17:$B$80,G2)>0,VLOOKUP(G2,'Data Entry Sheet'!$B$17:$L$80,11,FALSE),\" \")","v":" "},{"$f":"IF(COUNTIF('Data Entry Sheet'!$B$17:$B$80,H2)>0,VLOOKUP(H2,'Data Entry Sheet'!$B$17:$L$80,11,FALSE),\" \")","v":" "},{"$f":"IF(COUNTIF('Data Entry Sheet'!$B$17:$B$80,I2)>0,VLOOKUP(I2,'Data Entry Sheet'!$B$17:$L$80,11,FALSE),\" \")","v":" "},{"$f":"IF(COUNTIF('Data Entry Sheet'!$B$17:$B$80,J2)>0,VLOOKUP(J2,'Data Entry Sheet'!$B$17:$L$80,11,FALSE),\" \")","v":" "}]
["1-16",null,{"$f":"IF(COUNTIF('Data Entry Sheet'!$B$17:$B$80,C3)>0,VLOOKUP(C3,'Data Entry Sheet'!$B$17:$L$80,11,FALSE),\" \")","v":" "},{"$f":"IF(COUNTIF('Data Entry Sheet'!$B$17:$B$80,D3)>0,VLOOKUP(D3,'Data Entry Sheet'!$B$17:$L$80,11,FALSE),\" \")","v":" "},{"$f":"IF(COUNTIF('Data Entry Sheet'!$B$17:$B$80,E3)>0,VLOOKUP(E3,'Data Entry Sheet'!$B$17:$L$80,11,FALSE),\" \")","v":" "},{"$f":"IF(COUNTIF('Data Entry Sheet'!$B$17:$B$80,F3)>0,VLOOKUP(F3,'Data Entry Sheet'!$B$17:$L$80,11,FALSE),\" \")","v":" "},{"$f":"IF(COUNTIF('Data Entry Sheet'!$B$17:$B$80,G3)>0,VLOOKUP(G3,'Data Entry Sheet'!$B$17:$L$80,11,FALSE),\" \")","v":" "},{"$f":"IF(COUNTIF('Data Entry Sheet'!$B$17:$B$80,H3)>0,VLOOKUP(H3,'Data Entry Sheet'!$B$17:$L$80,11,FALSE),\" \")","v":" "},{"$f":"IF(COUNTIF('Data Entry Sheet'!$B$17:$B$80,I3)>0,VLOOKUP(I3,'Data Entry Sheet'!$B$17:$L$80,11,FALSE),\" \")","v":" "},{"$f":"IF(COUNTIF('Data Entry Sheet'!$B$17:$B$80,J3)>0,VLOOKUP(J3,'Data Entry Sheet'!$B$17:$L$80,11,FALSE),\" \")","v":" "}]
[]
[]
["Detectors 17-32",null,{"$f":"C2+16","v":19},{"$f":"D2+16","v":17},23,21,27,25,31,29]
{"$rows_left_out":21}