{"text_format":"1","workbook":"xlsx","n_sheets":6,"sheets":["1. Instructions","2. Enrollment Projections","3. Staffing Plan","4. Budget & Cash Flow (Year 0)","5. 5-Year Budget","CONTROL"],"not_rendered":{"charts":0,"images":0,"macros":0,"external_links":0,"defined_names":7,"comments":0,"pivot_tables":0},"unopened":[],"bounds":{"document_bytes":16777216,"sheet_cells":100000,"rows_first":2000,"rows_last":500,"rows_between":2000,"halvings":0,"cell_chars":16384,"cell_head_chars":4096},"cells_cut":0,"cells_raw":0,"read":"whole","date_system":"1900"}

{"sheet":"1. Instructions","index":0,"n_rows":17,"n_cols":6,"rows_kept":17,"cut":false,"hidden":false,"merged":[[2,2,2,4],[11,7,11,18],[14,7,14,18],[13,7,13,18]]}
[]
[]
[null,null,"Instructions for 5-Year Budget Projections Workbook"]
[null,null,null,"= Information should be entered into light gray shaded cells."]
[]
[null,null,null,"Name of Proposed Charter School:","Creek Point Academy"]
[null,null,null,"Planned Opening School Year (YYYY):",2024]
[null,null,null,"Planned Location (School Corporation):","Indianapolis Public Schools"]
[]
[null,null,null,"1. Instructions","• All organizers submitting a charter application to the Indiana Charter School Board must complete all four BLUE tabs of the Budget Projections Workbook. No information is required to be entered into WHITE cells, they will autofill as information is entered into GREY cells. \n• Column and Row references in these instructions are to the Excel spreadsheet Column or Row. "]
[null,null,null,"2. Enrollment Projection","• Please provide a summary of the school's projected enrollment for the proposed grade span for the next five years."]
[null,null,null,"3. Staffing Plan","• Please provide a list of administrative, instructional, and other staff along with estimates of proposed salaries and benefits. Please include both full and part-time employees and contractors. Projected salary and benefits should align with Year 0 and 5-Year budgets.\n\n• The estimated \"average salary\" for each position should include all taxable amounts (including taxable fringe benefits, stipends, bonuses, awards, and allowances).\n\n• \"Other Insurance\" includes health care, long-term care, life, disability.\n\n• \"Other Benefits\" are non-taxable benefits (e.g., educational assistance, dependent care assistance, transportation benefits, non-taxable fringe benefits, etc.)."]
[null,null,null,"4. Year 0 - Budget and Cash Flow","• Please provide budget and cash flow projections for the start-up year (Year 0)."]
[null,null,null,"5. 5-Year Budget","• Please provide 5-year budget projections (Year 1 - Year 5). Year 0 data will automatically populate once Tab 4 is completed. Note that the information provided in Tab 3 must align with the personnel expenses provided in Tab 5 or Tab 5 will throw an ERROR."]
[null,null,null,"Notes:","• Applicants proposing to operate a network of schools should add a worksheet or attach a separate file reflecting the consolidated network's 5-Year pro-forma budget, reflecting all components - including the regional back office/central office - of the Indiana network.\n\n• This template is not intended to be exhaustive. If it is unclear to which line a particular item of revenue or expense belongs, add it to the closest approximation or to one of the \"other\" categories and make a note in the budget narrative."]
[]
[null,null,null,null,null,"Ver. 7.20.23"]

{"sheet":"2. Enrollment Projections","index":1,"n_rows":45,"n_cols":11,"rows_kept":45,"cut":false,"hidden":false,"merged":[[12,10,12,15],[14,10,50,15],[2,3,2,8],[3,3,3,8],[4,3,4,8],[9,7,9,8]]}
[]
[]
[null,null,null,"School Enrollment Projections"]
[null,null,null,"(must align with Charter Application Enrollment Plan)"]
[]
[null,null,null,"School Name:",null,{"$f":"IF(ISBLANK('1. Instructions'!E6),\"Please enter School Name on Tab 1.\",'1. Instructions'!E6)","v":"Creek Point Academy"}]
[null,null,null,"Planned Opening Year:",null,{"$f":"IF(ISBLANK('1. Instructions'!E7),\"Please enter School's Opening Year on Tab 1.\",'1. Instructions'!E7)","v":2024},null,null,"REQUIRED"]
[null,null,null,"Planned Location:",null,{"$f":"IF(ISNUMBER(SEARCH(\"Select from drop-down list →\",'1. Instructions'!E8)),\"Please enter School's Planned Location on Tab 1.\",'1. Instructions'!E8)","v":"Indianapolis Public Schools"},null,null,"REQUIRED"]
[]
[null,null,null,"Is the proposal for an Adult High School (please see requirements below):",null,null,null,"Select from drop-down list →"]
[null,null,null,null,null,null,null,{"$f":"IF((ISNUMBER(SEARCH(\"Select from drop-down list →\",H10))), \"\", IF((ISNUMBER(SEARCH(\"No\",H10))), \"Complete Enrollment Lines 15-27 only.\", \"Complete Enrollment Line 31 only.\"))","v":""}]
[]
[null,null,null,"Enrollment","Year 1","Year 2","Year 3","Year 4","Year 5",null,"Notes & Definitions"]
[]
[null,null,null,"Kindergarten",50,75,100,100,100,null,"\n1) An \"adult high school\" is a charter school that has a majority of enrolled students that: (1) belong to a graduation cohort that has already graduated; or (2) are over the age of eighteen (18) years of age; at the time the student was first enrolled at the school. ICSB is prohibited from authorizing an adult high school unless the general assembly has made a specific appropriation for the high school pursuant to Indiana Code 20-24-7-13.5. If your proposal is for an adult high school, complete Row 31 only.\n\n2) A \"virtual student\" is defined as a student for whom at least fifty percent (50%) of the instructional services received from the school is virtual instruction. Virtual instruction means instruction that  is provided in an interactive learning environment created through technology in which students are separated from their teacher by time or space, or both. Students receiving more than 50% of their instruction virtually generate eighty-five percent (85%) of the foundation formula amount rather than 100%. The analysis is applicable on a per student basis.\n\n3) The \"basic\" tuition support grant for K-12 schools is equal to the following formula:\n\n     (Foundation Amount X ADM) + ((Complexity Multiplier  X Complexity Index) X ADM)\n\nThe Distribution calculations are an estimate based on projected enrollment multiplied by basic tuition support in the amounts as set forth in the most recently passed (2024-25 FY) budget-  Foundation = $6,590 for the 2023-24 SY and $6,681 for the 2024-25 SY (and beyond) and Complexity Multiplier = $3,983 for the 2023-24 SY and $4,024 for the 2024-25 SY. The school's actual distribution will be based on the school's ADM count of eligible pupils enrolled in the school on two count dates (in October and February) multiplied by the basic tuition support calculation. The calculation uses the Complexity Index for the school corporation in which the proposed charter school will be located- the school's actual Complexity Index amount will likely differ. The Special Education Grant amount is calculated on Tab 4 and uses the grant amount for moderate disabilities ($2,930 for the 2024-25 SY). The grant amount for severe disabilities is $11,695 for the 2024-25 SY).\n\n4)  The Adult Learner Grant amount for adult high schools is $6,750. The Adult Distribution is calculated by multiplying Total Enrollment by the Adult Grant. "]
[null,null,null,"Grade 1",56,56,84,84,84]
[null,null,null,"Grade 2",56,56,56,84,84]
[null,null,null,"Grade 3",28,56,56,56,84]
[null,null,null,"Grade 4",28,28,56,56,56]
[null,null,null,"Grade 5",26,28,28,56,56]
{"$rows_left_out":26}
{"sheet":"3. Staffing Plan","index":2,"n_rows":77,"n_cols":31,"rows_kept":77,"cut":false,"hidden":false,"merged":[[1,2,1,28],[9,25,9,27],[59,25,59,27],[9,5,9,7],[9,9,9,11],[6,19,6,29],[9,17,9,19],[76,2,76,22],[5,3,6,15],[69,2,72,22],[73,2,73,22],[74,2,74,22],[9,13,9,15],[68,2,68,19],[9,21,9,23],[59,13,59,15],[59,21,59,23],[75,2,75,22],[59,9,59,11],[59,5,59,7],[59,17,59,19]]}
[]
[null,null,"5-Year Projected Staffing Plan"]
[null,null,null,"School Name:",null,{"$f":"IF(ISBLANK('1. Instructions'!E6),\"Please enter School Name on Tab 1.\",'1. Instructions'!E6)","v":"Creek Point Academy"}]
[null,null,null,"Planned Opening Year:",null,{"$f":"IF(ISBLANK('1. Instructions'!E7),\"Please enter School's Opening Year on Tab 1.\",'1. Instructions'!E7)","v":2024}]
[]
[null,null,null,"•  Complete all relevant Grey Shaded areas -> Name of Position, Number of Positions, Average Salary, Health Insurance, Retirement Contribution, and Other Benefits.\n•  Projected salary and benefits should align with Year 0 and 5-Year budgets.\n•  Please read footnotes below for additional information before completing the worksheet."]
[]
[]
[]
[null,null,null,null,null,"Year 0",null,null,null,"Year 1",null,null,null,"Year 2",null,null,null,"Year 3",null,null,null,"Year 4",null,null,null,"Year 5"]
[null,null,null,null,null,"Number","Average Salary (1)","Total Expense",null,"Number","Average Salary","Total Expense",null,"Number","Average Salary","Total Expense",null,"Number","Average Salary","Total Expense",null,"Number","Average Salary","Total Expense",null,"Number","Average Salary","Total Expense"]
[null,null,null,"INSTRUCTIONAL STAFF"]
[null,null,null,"Classroom Teachers",null,null,0,{"$f":"F13*G13","v":0},null,12,62300,{"$f":"J13*K13","v":747600},null,14,64135,{"$f":"N13*O13","v":897890},null,17,66060,{"$f":"R13*S13","v":1123020},null,19,68030,{"$f":"V13*W13","v":1292570},null,21,70065,{"$f":"Z13*AA13","v":1471365}]
[null,null,null,"Specials Teachers",null,null,0,{"$f":"F14*G14","v":0},null,3,59400,{"$f":"J14*K14","v":178200},null,3,61200,{"$f":"N14*O14","v":183600},null,3,63000,{"$f":"R14*S14","v":189000},null,3,64900,{"$f":"V14*W14","v":194700},null,3,66900,{"$f":"Z14*AA14","v":200700}]
[null,null,null,"English Learner (EL) Teachers",null,null,0,0,null,3,56660,169980,null,4,58360,233440,null,5,60120,300600,null,6,61920,371520,null,7,63780,446460]
[null,null,null,"Special Education Teachers",null,null,0,0,null,2,59075,118150,null,2,60825,121650,null,3,62650,187950,null,4,64550,258200,null,4,66475,265900]
[null,null,null,"Academic Specialists",null,null,0,0,null,1,62050,62050,null,1,63900,63900,null,1,65800,65800,null,1,67800,67800,null,1,69850,69850]
[null,null,null,"English Learner (EL) Paraprofessionals",null,null,0,0,null,1.875,24106.667000000001,45200.000625000001,null,1.875,24800,46500,null,1.875,25546.666666666668,47900,null,1.875,26346.666666666668,49400,null,1.875,27093.333333333332,50800]
[null,null,null,"Special Education Aides",null,null,0,0,null,2.625,25371.43,66600.003750000003,null,3.5,26125.715,91440.002500000002,null,4.375,26902.857142857141,117700,null,4.375,27725,121296.875,null,4.375,28548.571428571428,124900]
[null,null,null,"Interventionists (Paraprofessionals)",null,null,0,0,null,0.5,23550,{"$f":"J20*K20","v":11775},null,0.5,24250,{"$f":"N20*O20","v":12125},null,2.5,24972,{"$f":"R20*S20","v":62430},null,3.75,25720,{"$f":"V20*W20","v":96450},null,5,26495,{"$f":"Z20*AA20","v":132475}]
{"$rows_left_out":58}
{"sheet":"4. Budget & Cash Flow (Year 0)","index":3,"n_rows":113,"n_cols":19,"rows_kept":113,"cut":false,"hidden":false,"merged":[[50,3,50,4],[43,3,43,4],[44,3,44,4],[46,3,46,4],[48,3,48,4],[41,3,41,4],[42,3,42,4],[37,3,37,4],[38,3,38,4],[49,3,49,4],[34,3,34,4],[39,3,39,4],[36,3,36,4],[32,3,32,4],[40,3,40,4],[12,17,13,17],[12,18,13,18],[16,3,16,4],[14,3,14,4],[12,10,13,10],[12,16,13,16],[18,3,18,4],[19,3,19,4],[20,3,20,4],[31,3,31,4],[21,3,21,4],[22,3,22,4],[23,3,23,4],[24,3,24,4],[25,3,25,4],[26,3,26,4],[27,3,27,4],[29,3,30,4],[7,3,7,18],[6,3,6,18],[9,3,9,18],[17,3,17,4],[1,3,1,18],[12,9,13,9],[12,11,13,11],[12,12,13,12],[12,13,13,13],[12,14,13,14],[11,3,11,4],[12,15,13,15],[12,3,13,4],[12,6,13,6],[12,7,13,7],[12,8,13,8],[52,3,52,4],[54,3,54,4],[55,3,55,4],[56,3,56,4],[58,3,58,4],[60,3,60,4],[61,3,61,4],[62,3,62,4],[63,3,63,4],[64,3,64,4],[65,3,65,4],[66,3,66,4],[67,3,67,4],[68,3,68,4],[69,3,69,4],[96,3,96,4],[70,3,70,4],[71,3,71,4],[72,3,72,4],[73,3,73,4],[74,3,74,4],[91,3,91,4],[92,3,92,4],[93,3,93,4],[76,3,76,4],[78,3,78,4],[79,3,79,4],[80,3,80,4],[107,3,107,4],[15,3,15,4],[111,3,111,14],[112,3,112,14],[101,3,101,4],[103,3,103,4],[104,3,104,4],[105,3,105,4],[106,3,106,4],[94,3,94,4],[98,3,98,4],[99,3,99,4],[100,3,100,4],[88,3,88,4],[89,3,89,4],[90,3,90,4]]}
[]
[null,null,null," Annual Operating Budget and Cash Flow Projections  -- Fiscal Year 0 -- Pre-Opening  Period"]
[]
[null,null,null,"School Name:",{"$f":"IF(ISBLANK('1. Instructions'!E6),\"Please enter School Name on Tab 1.\",'1. Instructions'!E6)","v":"Creek Point Academy"}]
[null,null,null,"Planned Opening Year:",{"$f":"IF(ISBLANK('1. Instructions'!E7),\"Please enter School's Opening Year on Tab 1.\",'1. Instructions'!E7)","v":2024}]
[]
[null,null,null,"Special Instructions for Schools Contracting with a Management Company:"]
[null,null,null,"Please include a note in the assumptions column and budget narrative if any of of the listed amounts include additional service, consulting, facility, or licensing fees paid to a management company or affiliate of a management company that are not included in Line 97 (CMO/EMO fee). For example, you should note any additional fees for instructional or support supplies and resources; license fees for materials, software, or educational programming; or fees related to the management, sale, or lease of real estate. Please also state whether your facility is leased or purchased from a management company or affiliate of a management company."]
[]
[null,null,null,"If a line item is completed that includes the words \"(please describe)\" a specific description of the item must be provided in the appropriate box in Column N on Tab 5.\nFailure to provide a description as requested may result in rejection of the submission."]
[]
[]
[null,null,null,"REVENUE",null,null,"July","August","September","October","November","December","January","February","March","April","May","June","Year 0 Totals"]
[]
[null,null,null,"Federal Revenue - See Footnotes"]
[null,null,null,"Public Charter School Program Grant (1)",null,null,0,0,0,0,0,0,0,0,0,0,0,0,{"$f":"SUM(G16:R16)","v":0}]
[null,null,null,"Other Federal Revenue (please describe on Tab 5)",null,null,0,0,0,0,0,0,0,0,0,0,0,0,{"$f":"SUM(G17:R17)","v":0}]
[]
[null,null,null,"Total Federal Revenue:",null,null,{"$f":"SUM(G16:G17)","v":0},0,0,0,0,0,0,0,0,0,0,0,{"$f":"SUM(G19:R19)","v":0}]
[]
{"$rows_left_out":94}
{"sheet":"5. 5-Year Budget","index":4,"n_rows":182,"n_cols":14,"rows_kept":182,"cut":false,"hidden":false,"merged":[[17,3,17,4],[28,3,28,4],[29,3,29,4],[30,3,30,4],[98,7,98,11],[15,3,15,4],[16,3,16,4],[25,3,25,4],[26,3,26,4],[31,7,31,11],[18,3,18,4],[27,3,27,4],[32,3,32,4],[33,3,33,4],[23,3,23,4],[24,3,24,4],[19,3,19,4],[20,3,20,4],[21,3,21,4],[22,3,22,4],[34,3,34,4],[35,3,35,4],[36,3,36,4],[37,3,37,4],[31,3,31,4],[38,3,38,4],[39,3,39,4],[40,3,40,4],[41,3,41,4],[42,3,42,4],[43,3,43,4],[44,3,44,4],[45,3,45,4],[46,3,46,4],[47,3,47,4],[48,3,48,4],[57,3,57,4],[58,3,58,4],[59,3,59,4],[60,3,60,4],[61,3,61,4],[49,3,49,4],[50,3,50,4],[51,3,51,4],[52,3,52,4],[54,3,55,4],[68,3,68,4],[69,3,69,4],[71,3,71,4],[73,3,73,4],[63,3,63,4],[65,3,65,4],[66,3,66,4],[67,3,67,4],[80,3,80,4],[81,3,81,4],[82,3,82,4],[84,3,84,4],[74,3,74,4],[75,3,75,4],[76,3,76,4],[77,3,77,4],[78,3,78,4],[79,3,79,4],[92,3,92,4],[94,3,94,4],[96,3,96,4],[86,3,86,4],[88,3,88,4],[89,3,89,4],[90,3,90,4],[91,3,91,4],[98,3,98,4],[99,3,99,4],[100,3,100,4],[101,3,101,4],[102,3,102,4],[103,3,103,4],[112,3,112,4],[114,3,114,4],[116,3,116,4],[110,3,110,4],[111,3,111,4],[104,3,104,4],[105,3,105,4],[106,3,106,4],[108,3,108,4],[120,3,120,4],[161,3,161,4],[155,3,155,4],[130,3,130,4],[136,3,136,4],[131,3,131,4],[132,3,132,4],[133,3,133,4],[134,3,134,4],[181,3,181,13],[150,3,150,4],[151,3,151,4],[138,3,138,4],[167,3,167,4],[12,11,13,11],[141,3,141,4],[142,3,142,4],[160,3,160,4],[126,3,126,4],[127,3,127,4],[128,3,128,4],[129,3,129,4],[156,3,156,4],[140,3,140,4],[32,13,41,13],[44,13,50,13],[74,13,84,13],[170,3,170,4],[122,3,122,4],[123,3,123,4],[124,3,124,4],[125,3,125,4],[117,3,117,4],[1,3,1,13],[12,3,13,4],[12,6,13,6],[12,7,13,7],[12,8,13,8],[176,3,176,13],[177,3,177,13],[178,3,178,13],[9,3,9,13],[7,3,7,13],[6,3,6,13],[99,13,108,13],[89,13,94,13],[123,13,138,13],[111,13,114,13],[117,13,120,13],[16,13,29,13],[12,13,13,13],[168,3,168,4],[169,3,169,4],[135,3,135,4],[12,9,13,9],[12,10,13,10],[118,3,118,4],[179,3,179,13],[180,3,180,13],[175,3,175,13],[141,13,158,13],[161,13,167,13],[162,3,162,4],[163,3,163,4],[164,3,164,4],[165,3,165,4],[158,3,158,4],[154,3,154,4],[152,3,152,4],[153,3,153,4],[171,3,171,4]]}
[]
[null,null,null,"Projected New School Annual Operating Budget  -- YEARS 1 - 5 (Fiscal Year July 1-June 30)"]
[]
[null,null,null,"School Name:",{"$f":"IF(ISBLANK('1. Instructions'!E6),\"Please enter School Name on Tab 1.\",'1. Instructions'!E6)","v":"Creek Point Academy"}]
[null,null,null,"Planned Opening Year:",{"$f":"IF(ISBLANK('1. Instructions'!E7),\"Please enter School's Opening Year on Tab 1.\",'1. Instructions'!E7)","v":2024}]
[]
[null,null,null,"Special Instructions for Schools Contracting with a Management Company:"]
[null,null,null,"Please include a note in the assumptions column and budget narrative if any of of the listed amounts include additional service, consulting, facility, or licensing fees paid to a management company or affiliate of a management company that are not included in Line 97 (CMO/EMO fee). For example, you should note any additional fees for instructional or support supplies and resources; license fees for materials, software, or educational programming; or fees related to the management, sale, or lease of real estate. Please also state whether your facility is leased or purchased from a management company or affiliate of a management company."]
[]
[null,null,null,"If a line item is completed that includes the words \"(please describe)\" a specific description of the item must be provided in the appropriate box in Column N on Tab 5.\nFailure to provide a description as requested may result in rejection of the submission."]
[]
[]
[null,null,null,"REVENUES",null,null,"Year 0","Year 1","Year 2","Year 3","Year 4","Year 5",null,"Additional Information"]
[]
[]
[null,null,null,"State Revenue - See Footnotes",null,null,null,null,null,null,null,null,null,"Other State Grants (Row 29)"]
[null,null,null,"Basic Tuition Support / Adult Learners Grant - From Tab 2",null,null,null,{"$f":"IF('2. Enrollment Projections'!E33 > 0, '2. Enrollment Projections'!E43, '2. Enrollment Projections'!E41)","v":2608824.5759999999},{"$f":"IF('2. Enrollment Projections'!F33 > 0, '2. Enrollment Projections'!F43, '2. Enrollment Projections'!F41)","v":3057216.3},{"$f":"IF('2. Enrollment Projections'!G33 > 0, '2. Enrollment Projections'!G43, '2. Enrollment Projections'!G41)","v":3750185.3279999997},{"$f":"IF('2. Enrollment Projections'!H33 > 0, '2. Enrollment Projections'!H43, '2. Enrollment Projections'!H41)","v":4239339.9359999998},{"$f":"IF('2. Enrollment Projections'!I33 > 0, '2. Enrollment Projections'!I43, '2. Enrollment Projections'!I41)","v":4687731.66},null,"  "]
[null,null,null,"Special Education Grant - From Tab 2",null,null,null,{"$f":"IF('2. Enrollment Projections'!E33>0,('2. Enrollment Projections'!E33*'2. Enrollment Projections'!E36)*CONTROL!$K$20,('2. Enrollment Projections'!E29*'2. Enrollment Projections'!E36)*CONTROL!$K$20)","v":117200},{"$f":"IF('2. Enrollment Projections'!F33>0,('2. Enrollment Projections'!F33*'2. Enrollment Projections'!F36)*CONTROL!$K$20,('2. Enrollment Projections'!F29*'2. Enrollment Projections'!F36)*CONTROL!$K$20)","v":137343.75},{"$f":"IF('2. Enrollment Projections'!G33>0,('2. Enrollment Projections'!G33*'2. Enrollment Projections'!G36)*CONTROL!$K$20,('2. Enrollment Projections'!G29*'2. Enrollment Projections'!G36)*CONTROL!$K$20)","v":168475},{"$f":"IF('2. Enrollment Projections'!H33>0,('2. Enrollment Projections'!H33*'2. Enrollment Projections'!H36)*CONTROL!$K$20,('2. Enrollment Projections'!H29*'2. Enrollment Projections'!H36)*CONTROL!$K$20)","v":190450},{"$f":"IF('2. Enrollment Projections'!I33>0,('2. Enrollment Projections'!I33*'2. Enrollment Projections'!I36)*CONTROL!$K$20,('2. Enrollment Projections'!I29*'2. Enrollment Projections'!I36)*CONTROL!$K$20)","v":210593.75}]
[null,null,null,"Honors Diploma/Academic Performance Grant",null,null,null,0,0,0,0,0]
[null,null,null,"Career and  Technical Education",null,null,null,0,0,0,0,0]
{"$rows_left_out":163}
{"sheet":"CONTROL","index":5,"n_rows":306,"n_cols":12,"rows_kept":306,"cut":false,"hidden":true,"merged":[[10,1,10,9],[12,2,12,6]]}
[]
[null,"Instructions:","+ Ensure all editable cells are unlocked and all un-editable cells are locked."]
[null,null,"+  On Review Tab, select “Protect Sheet” and make sure only “Select Unlocked Cells” is checked (PERFORM FOR EACH SHEET)."]
[null,null,"+ Enter Password (STORE PASSWORD SOMEWHERE RECOVERABLE)."]
[null,null,"+ To Hide “CONTROL” Sheet"]
[null,null,"  - Switch to VBE (press [Alt]+[F11])."]
[null,null,"  - Select Sheet8(CONTROL)."]
[null,null,"  - In Properties window, select “2 – xlSheetVeryHidden” from the Visible property's drop-down list."]
[null,null,"  - To Unhide, select “-1 – xlSheetVeryHidden” from the Visible property's drop-down list."]
[]
[null,"All Grant amounts are from 2023 Biennial Budget. Complexity Index Data (Columns D & F) are taken from LSA Budget Projections Run (04/27/23).\nOver the biennium, Column E (FY 24) is used for Current Year and Column G (FY 25) is used for Years 1-5."]
[]
[null,null,"Data Validation List (Complexity)"]
[]
[null,"Corp No.","School Corporation","FY 24 Index","FY 24 $/ADM","FY 25 Index2","FY 25 $/ADM"]
[null,null,"Select from drop-down list →",null,null,null,null,null,"Grants","FY 2024","FY 2025"]
[null,"0015","Adams Central Community Schools",7.2499999999999995E-2,{"$f":"(D17*$J$18)+$J$17","v":6878.7674999999999},7.2499999999999995E-2,{"$f":"(F17*$K$18)+$K$17","v":6972.74},null,"Foundation Amount:",6590,6681]
[null,"5265","Alexandria Com School Corp",0.21340000000000001,7439.9722000000002,0.21340000000000001,{"$f":"(F18*$K$18)+$K$17","v":7539.7215999999999},null,"Complexity Multiplier:",3983,4024]
[null,"5275","Anderson Community School Corp",0.40279999999999999,8194.3523999999998,0.40279999999999999,8301.8672000000006,null,"ELL Adjustment:",null,null,"     (not currently calculated - See IC 20-43-6-3(b) STEP 4)"]
[null,"5470","Argos Community Schools",0.13639999999999999,7133.2812000000004,0.13639999999999999,7229.8735999999999,null,"Sped Grant (moderate):",2790,2930,"     (not calculated for severe disabilities - See IC 20-43-7-6)"]
{"$rows_left_out":286}